{"text_format":"1","workbook":"xlsx","n_sheets":22,"sheets":["Склаская","Столы на ДСП опорах","Столы на П-обр. 60х30","Столы на А обр. 60х30","Столы на О обр. 60х30","Столы на П-обр. 40х40","Столы на А обр. 40х40","Столы на О-обр. 40х40","Шкафы","Тумбы","Переговорные столы","миникухни","Экраны+Аксессуары","Комп--щие Bench-систем","Цвет мет. опор","Цвет столешницы","Цвет лючка","Цвет ткани","Цвет корпуса шкафа","Цвет стекла","Столешницы","Лист3"],"not_rendered":{"charts":0,"images":286,"macros":0,"external_links":3,"defined_names":28,"comments":12,"pivot_tables":0},"unopened":[],"bounds":{"document_bytes":16777216,"sheet_cells":100000,"rows_first":2000,"rows_last":500,"rows_between":2000,"halvings":0,"cell_chars":16384,"cell_head_chars":4096},"cells_cut":0,"cells_raw":0,"read":"whole","date_system":"1900"}

{"sheet":"Склаская","index":0,"n_rows":193,"n_cols":8,"rows_kept":193,"cut":false,"hidden":false,"merged":[[55,1,55,5],[181,4,182,4],[183,4,184,4],[187,2,189,2],[187,4,189,4],[164,4,165,4],[167,1,168,2],[169,0,169,4],[172,1,173,2],[179,4,180,4],[177,1,177,2],[178,1,178,4],[174,1,174,4],[152,4,154,4],[155,1,156,3],[155,4,156,4],[157,1,157,4],[142,1,142,4],[143,4,144,4],[145,4,146,4],[147,4,148,4],[149,1,150,3],[149,4,150,4],[158,4,160,4],[163,2,163,4],[139,1,141,3],[139,4,141,4],[121,4,122,4],[123,4,124,4],[125,4,126,4],[127,1,128,3],[127,4,128,4],[129,1,129,4],[130,4,132,4],[133,1,134,3],[133,4,134,4],[135,1,135,4],[136,4,138,4],[151,1,151,4],[120,1,120,4],[31,2,33,2],[31,4,33,4],[34,2,36,2],[34,4,36,4],[64,2,66,2],[79,1,79,5],[107,1,107,3],[109,2,111,2],[117,1,119,3],[117,4,119,4],[37,2,39,2],[37,4,39,4],[40,2,42,2],[40,4,42,4],[22,2,23,2],[22,4,23,4],[24,2,25,2],[24,4,25,4],[26,2,27,2],[43,2,45,2],[43,4,45,4],[2,1,2,5],[3,1,3,4],[5,6,8,6],[6,2,8,2],[9,2,12,2],[9,4,12,4],[28,2,30,2],[28,4,30,4],[13,2,15,2],[13,4,15,4],[16,2,18,2],[16,4,18,4],[19,2,21,2],[19,4,21,4],[46,2,48,2],[46,4,48,4],[49,2,51,2],[49,4,51,4],[52,2,54,2],[52,4,54,4]]}
[null,"EVOLUTION (складская программа)",null,null,null,"2025-05-23","Оптовая\nскидка\nна коллекцию \nEvolution ",25]
[null,null,null,null,null,null,"Оптовая\nскидка\nна аксессуары \nAKS",15]
[null,"Складская программа \nСтолешницы столов, топы тумб, корпуса и полки шкафов: Дуб Честерфилд. \nФасады тумб и шкафов, корпуса тумб: Дуб Честерфилд, Белый\nФронтали столов, экраны из ЛДСП, корпуса тумб: Антрацит, Белый. \nСкладские шкафы и тумбы с белыми элементами размещены в коллекции EcoStyle. \nСтолы на металлических П, А, О-образных опорах сечением 60х30 мм в цв. Антрацит.\nЗаглушки кабель-каналов столов и бенчей, ручки - Антрацит.\n"]
[null," "]
[]
[null,"Артикул","Наименование","Размеры Ш*Г*В (мм)","Изображение","Розничная Цена, руб."]
["EVL155","EVL155/U003/ANT/ANT.U003","Стол письменный на ДСП опорах шириной 700 мм","1200*700*750",null,9254.1249999999982]
["EVL156","EVL156/U003/ANT/ANT.U003",null,"1400*700*750",null,9895.0249999999996]
["EVL157","EVL157/U003/ANT/ANT.U003",null,"1600*700*750",null,10535.749999999998]
["EVL167SX","EVL167SX/U003/ANT/ANT.U003","Стол криволинейный левый/правый на ДСП опорах, \nглубиной 700/900 мм","1200*900*750","правый",10479.700000000001]
["EVL167DX","EVL167DX/U003/ANT/ANT.U003",null,"1200*900*750",null,10479.700000000001]
["EVL168SX","EVL168SX/U003/ANT/ANT.U003",null,"1400*900*750",null,10803.1]
["EVL168DX","EVL168DX/U003/ANT/ANT.U003",null,"1400*900*750",null,10803.1]
["EVL101/П/60*30/","EVL101/П/60*30/ANT/ANT.U003","Стол письменный на \nП-образном м/к 60х30, глубиной 700 мм, столешница в цв. Дуб Честерфилд, опоры Антрацит, заглушка кабель-канала Антрацит","1200*700*750",null,18989]
["EVL102/П/60*30/","EVL102/П/60*30/ANT/ANT.U003",null,"1400*700*750",null,19543]
["EVL103/П/60*30/","EVL103/П/60*30/ANT/ANT.U003",null,"1600*700*750",null,20404]
["EVL101/А/60*30/","EVL101/А/60*30/ANT/ANT.U003","Стол письменный на А-образном м/к 60х30, глубиной 700 мм, столешница в цв. Дуб Честерфилд, опоры Антрацит, заглушка кабель-канала Антрацит","1200*700*750",null,19102.600000000002]
["EVL102/А/60*30/","EVL102/А/60*30/ANT/ANT.U003",null,"1400*700*750",null,19831.900000000001]
["EVL103/А/60*30/","EVL103/А/60*30/ANT/ANT.U003",null,"1600*700*750",null,20688.800000000003]
["EVL101/О/60*30/","EVL101/О/60*30/ANT/ANT.U003","Стол письменный на О-образном м/к 60х30, глубиной 700 мм, столешница в цв. Дуб Честерфилд, опоры Антрацит, заглушка кабель-канала Антрацит","1200*700*750",null,20364]
["EVL102/О/60*30/","EVL102/О/60*30/ANT/ANT.U003",null,"1400*700*750",null,20916]
["EVL103/О/60*30/","EVL103/О/60*30/ANT/ANT.U003",null,"1600*700*750",null,21777]
["EVL106SX/П/60*30/","EVL106SX/П/60*30/ANT/ANT.U003","Стол криволинейный левый/правый на П образном м/к 60х30, глубиной 700/900 мм","1400*900*750","правый",18832]
["EVL106DX/П/60*30/","EVL106DX/П/60*30/ANT/ANT.U003",null,"1400*900*750",null,18832]
["EVL106SX/А/60*30/","EVL106SX/А/60*30/ANT/ANT.U003","Стол криволинейный левый/правый на А-образном м/к 60х30, глубиной 700/900 мм","1400*900*750","правый",20212.5]
["EVL106DX/А/60*30/","EVL106DX/А/60*30/ANT/ANT.U004",null,"1400*900*750",null,20212.5]
["EVL106SX/О/60*30/","EVL106SX/О/60*30/WHT/ANT.U003","Стол криволинейный левый/правый на О образном  м/к 60х30, глубиной 700/900 мм","1400*900*750",null,21652]
["EVL106DX/О/60*30/","EVL106DX/О/60*30/WHT/ANT.U004",null,"1400*900*750",null,21652]
["EVL604/П/60*30/","EVL604/П/60*30/ANT/ANT.U003","Рабочая станция на П образном м/к 60х30 глубиной 1436 мм, столешница Дуб Честерфилд, заглушка  и опоры Антрацит","1200*1436*750",null,28582.400000000001]
["EVL605/П/60*30/","EVL605/П/60*30/ANT/ANT.U003",null,"1400*1436*750",null,34100]
["EVL606/П/60*30/","EVL606/П/60*30/ANT/ANT.U003",null,"1600*1436*750",null,35852]
["EVL604/А/60*30/","EVL604/А/60*30/ANT/ANT.U003","Рабочая станция на А образном м/к 60х30 глубиной 1436 мм, столешница Дуб Честерфилд, заглушка  и опоры Антрацит","1200*1436*750",null,29642]
["EVL605/А/60*30/","EVL605/А/60*30/ANT/ANT.U003",null,"1400*1436*750",null,34723]
["EVL606/А/60*30/","EVL606/А/60*30/ANT/ANT.U003",null,"1600*1436*750",null,36475]
["EVL604/О/60*30/","EVL604/О/60*30/ANT/ANT.U003","Рабочая станция на О образном м/к 60х30 глубиной 1436 мм, столешница Дуб Честерфилд, заглушка  и опоры Антрацит","1200*1436*750",null,34709.4]
["EVL605/О/60*30/","EVL605/О/60*30/ANT/ANT.U003",null,"1400*1436*750",null,36159.200000000004]
["EVL606/О/60*30/","EVL606/О/60*30/ANT/ANT.U003",null,"1600*1436*750",null,37582.600000000006]
[null,"EVL702/П/60*30/ANT/ANT.U003","Рабочая станция на П образном м/к 60х30 \nс тумбой EVL301\n(композиция стол \nEVL101-103+тумба)","1650*700*750","Тумба 450х700х750",{"$f":"F14+$F$68","v":32824}]
[null,"EVL703/П/60*30/ANT/ANT.U003",null,"1850*700*750",null,{"$f":"F15+$F$68","v":33378}]
[null,"EVL704/П/60*30/ANT/ANT.U003",null,"2050*700*750",null,34239]
[null,"EVL712/П/60*30/ANT/ANT.U003","Рабочая станция \nна П образном м/к 60х30 \nсо шкафом-купе EVL433\n(композиция двойной бенч+шкаф-купе)","1610*1436*750","Шкаф-купе приставной 1440х410х750",{"$f":"F29+$F$77","v":47186.400000000001}]
[null,"EVL713/П/60*30/ANT/ANT.U003",null,"1810*1436*750",null,{"$f":"F30+$F$77","v":52704}]
[null,"EVL714/П/60*30/ANT/ANT.U003",null,"2010*1436*750",null,54456]
[null,"EVL717/П/60*30/ANT/ANT.U003","Рабочая станция \nна П образном м/к 60х30\nсо шкафом-купе EVL430\n(композиция двойной бенч+шкаф-купе)","1610*1436*1098","Шкаф-купе приставной  1440х410х1098",{"$f":"F29+$F$78","v":51606.400000000001}]
[null,"EVL718/П/60*30/ANT/ANT.U003",null,"1810*1436*1098",null,{"$f":"F30+$F$78","v":57124}]
[null,"EVL719/П/60*30/ANT/ANT.U003",null,"2010*1436*1098",null,58876]
[null,"EVL702/А/60*30/ANT/ANT.U003","Рабочая станция на \nА-образном м/к 60х30\nс тумбой EVL301\n(композиция стол+тумба)","1650*700*750","Тумба 450х700х750",{"$f":"F17+$F$68","v":32937.600000000006}]
[null,"EVL703/А/60*30/ANT/ANT.U003",null,"1850*700*750",null,{"$f":"F18+$F$68","v":33666.9}]
[null,"EVL704/А/60*30/ANT/ANT.U003",null,"2050*700*750",null,34523.800000000003]
[null,"EVL712/А/60*30/ANT/ANT.U003","Рабочая станция на \nА-образном м/к 60х30 \nсо шкафом-купе EVL433\n(композиция двойной бенч+шкаф-купе)","1610*1436*750","Шкаф-купе приставной\n1440х410х750",{"$f":"F32+$F$77","v":48246}]
[null,"EVL713/А/60*30/ANT/ANT.U003",null,"1810*1436*750",null,{"$f":"F33+$F$77","v":53327}]
[null,"EVL714/А/60*30/ANT/ANT.U003",null,"2010*1436*750",null,{"$f":"F34+$F$77","v":55079}]
[null,"EVL717/А/60*30/ANT/ANT.U003","Рабочая станция на \nА-образном м/к 60х30 \nсо шкафом-купе EVL430\n(композиция двойной бенч+шкаф-купе)","1610*1436*1098","Шкаф-купе приставной 1440х410х1098",{"$f":"F32+$F$78","v":52666}]
[null,"EVL718/А/60*30/ANT/ANT.U003",null,"1810*1436*1098",null,{"$f":"F33+$F$78","v":57747}]
[null,"EVL719/А/60*30/ANT/ANT.U003",null,"2010*1436*1098",null,59499]
[null,"Внимание! Центральная опора бенчей имеет уменьшенный горизонтальный размер и повышенную жесткость. \nЧто обеспечивает удобство размещения сотрудников и устойчивость конструкции.↓"]
["EVL666/П/60*30/","EVL666/П/60*30/ANT/ANT.U003","Рабочая станция \nна 4 раб.места \nна П образном м/к 60х30\nс шириной 1-го рабочего места 700 мм","2400*1436*750",null,54434.600000000006]
["EVL666/А/60*30/","EVL666/A/60*30/ANT/ANT.U003","Рабочая станция на 4 раб.места на А-образном м/к 60х30 с шириной 1-го рабочего места 700 мм","2400*1436*750",null,54434.600000000006]
["EVL666/О/60*30/","EVL666/О/60*30/ANT/ANT.U003","Рабочая станция на 4 раб.места на О образном  м/к 60х30","2400*1436*750",null,54435]
["EVL675/П/60*30/","EVL675/П/60*30/ANT/ANT.U003","Рабочая станция на 6 раб.места на П образном м/к 30х60 с шириной 1-го рабочего места 700 мм","3600*1436*750",null,91994.1]
["EVL675/А/60*30/","EVL675/А/60*30/ANT/ANT.U003","Рабочая станция на 6 раб.места на А образном м/к 60х30 с шириной 1-го рабочего места 700 мм","3600*1436*750",null,91994.1]
["EVL675/О/60*30/","EVL675/О/60*30/ANT/ANT.U003","Рабочая станция на 6 раб.места на О образном м/к 60х30 с шириной 1-го рабочего места 700 мм","3600*1436*750",null,92559.500000000015]
["EVL180/П/60*30/","EVL180/П/60*30/ANT.U003","Приставка к столу рабочая 1000х500 (используется в качестве брифинга или боковой приставки) П-образ. м/к 60х30, столешница в цв. Дуб Честерфилд, опоры Антрацит","1000x500x750",null,12603.800000000001]
["EVL180/О/60*30/","EVL180/О/60*30/ANT.U003","Приставка к столу рабочая 1000х500 (используется в качестве брифинга или боковой приставки) О-образ. м/к 60х30 ","1000x500x750",null,12603.800000000001]
[null,"EVL821/П/60х30/ANT/ANT.U003","Стол для переговоров \n2 м. на металлических опорах","2000x1000x750   ",null,22788.7]
[null,"EVL821/А/60х30/ANT/ANT.U003",null,"2000x1000x750   ",null,23106.600000000002]
[null,"EVL821/О/60х30/ANT/ANT.U003",null,"2000x1000x750   ",null,23655.500000000004]
["EVL301","EVL301/ANT/ANT/ANT.U003","Тумба приставная 450х700.\nТоп в цв. Дуб Честерфилд, фасады, боковины, задняя стенка, ручки - Антрацит","450х700х750",null,13835]
["EVL307","EVL307/ANT/ANT/ANT.U003","Тумба мобильная на колёсах 3 ящика EVL307 замок на верхний ящик. \nТоп в цв. Дуб Честерфилд, фасады, боковины, задняя стенка Антрацит","450х475х570",null,9627]
["EVL311","EVL311/ANT/ANT/ANT.U003","Тумба сервисная универсальная 880","880х475х570",null,13720]
[null,"EVL312/ANT/ANT/ANT.U003","Тумба сервисная универсальная 1140","1140х475х570",null,16746]
[null,"EVL308/ANT/ANT/ANT.U003","Тумба приставная  4 ящика 450х475 замок на верхний ящик (только для криволинейных столов)","450х475х750",null,13250.6]
[null,"EVL309/ANT/ANT/ANT.U003","Тумба приставная  4 ящика 790х475 замок на верхний ящик (для криволинейных столов)","790х475х750",null,14863.2]
["EVL290","EVL293/ANT.ANT","Контейнер подвесной с 1 ящиком Тип - 2\n(замок на ящик)\nФасады, корпус - Антрацит, ручки Антрацит","448х478х166",null,4105]
[null,"EVL294/ANT.ANT","Контейнер подвесной с 2 ящиками Тип - 2\n(замок на верхний ящик)\nФасады, корпус - Антрацит, ручки Антрацит","448х478х296",null,6155]
[null,"EVL903/ANT/ANT/ANT.U003","Оргтауэр низкий.\nТоп в цв. Дуб Честерфилд, фасады, боковины, задняя стенка, ручки Антрацит","390х700х750",null,14024]
["EVL433/ANT/ANT/ANT.U003","EVL433/ANT/ANT/ANT.U003","Шкаф-купе приставной 1440х750\nТоп в цв. Дуб Честерфилд, фасады, боковины, задняя стенка Антрацит","1440х410х750",null,18604]
[null,"EVL430/ANT/ANT/ANT.U003","Шкаф-купе приставной 1440х1098\nТоп в цв. Дуб Честерфилд, фасады, боковины, задняя стенка Антрацит","1440х410х1098",null,23024]
["EVL905","EVL905/ANT.U003","Стеллаж настольный\nКорпус Антрацит, топ Дуб Честерфилд.","350х1100х1100",null,8957]
[null,"Блок с ящиками или дверью открывается только с одной стороны, с другой расположен неподвижный \"фальш-фасад\" с ручкой. Рекомендуем с каждой стороны размещать по одному блоку, открывающемуся в сторону сотрудника.↓"]
[null,"EVL905/ANT.U003+EVL914/ANT.U003+EVL915/ANT.U003","Стеллаж настольный\nКорпус Антрацит, топ Дуб Честерфилд.+ Блок ящиков+Блок с дверью для стеллажа настольного Дуб Честерфилд","350х1100х1100",null,21956]
["EVL400","EVL400/ANT.U003","Стеллаж высокий 800х2050.\nКорпус и полки Дуб Честерфилд, задняя стенка Антрацит","800х344х2052",null,12946]
["EVL401","EVL401/U003/GRAFIT/ANT.U003","Шкаф для документов комбинированный 800х2050. Корпус, полки и фасады Дуб Честерфилд, задняя стенка Антрацит, стекло графит","800х364х2052",null,20443.774999999998]
["EVL403","EVL403/U003/ANT.U003","Шкаф для документов (низ малые фасады, верх открытый) 800х2050.\nКорпус, полки и фасады Дуб Честерфилд, задняя стенка Антрацит.","800х364х2052",null,13863.199999999997]
["EVL404","EVL404/U003/ANT.U003","Шкаф для документов 4 двери с нишей 800х2050. \nКорпус, полки и фасады Дуб Честерфилд, задняя стенка Антрацит.","800х364х2052",null,18996]
["EVL406","EVL406/U003/ANT.U003","Шкаф для документов ( низ средние фасады, верх открытый) 800х2050. Корпус, полки и фасады Дуб Честерфилд, задняя стенка Антрацит.","800х364х2052",null,14646.074999999999]
["EVL407","EVL407/U003/ANT.U003","Шкаф для документов с глухими фасадами 800х2050. Корпус, полки и фасады Дуб Честерфилд, задняя стенка Антрацит.","800х364х2052",null,16616.649999999998]
["EVL408","EVL408/U003/ANT.U003","Шкаф для одежды с замком 800х2050. Корпус, полки и фасады Дуб Честерфилд, задняя стенка Антрацит.","800х364х2052",null,18121]
["EVL410","EVL410/U003/ANT.U003","Шкаф для одежды с замком глубокий 800х2050.\nКорпус, полки и фасады Дуб Честерфилд, задняя стенка Антрацит.","800х600х2052",null,19893.199999999997]
["EVL413","EVL413/U003/ANT.U003","Шкаф для документов узкий (низ средний фасад, верх открытый) 600х2050. Корпус и полки Дуб Честерфилд, задняя стенка Антрацит","600х364х2052",null,14063]
["EVL415","EVL415/ANT.U003","Стеллаж средний, \nКорпус и полки Дуб Честерфилд, задняя стенка Антрацит","800х344х1250",null,8620]
["EVL417","EVL417/U003/ANT.U003","Шкаф для документов средний с глухими фасадами и открытой нишей. Корпус и полки Дуб Честерфилд, задняя стенка Антрацит","800х364х1250",null,11645]
["EVL418","EVL418/U003/ANT.GRAFIT","Шкаф средний со стеклянными фасадами. Корпус и полки Дуб Честерфилд, задняя стенка Антрацит, стекло графит","800х364х1250",null,14062.249999999996]
["EVL416","EVL416/U003/ANT.U003","Шкаф для документов средний с глухими фасадами, , задняя стенка Антрацит.","800х364х1250",null,12546]
["EVL423","EVL423/U003/ANT.U003","Шкаф низкий. Корпус и полки Дуб Честерфилд, задняя стенка Антрацит.","800х364х870",null,9632]
["EVL436","EVL436/U003/ANT.U003","Локер на 25 ячеек (5х5 дверей) с ограничителем и обычным замком. Корпус, фасады и полки Дуб Честерфилд, задняя стенка Антрацит.","2000х360х1850",null,69182]
["EVL439","EVL439.U003"," Стеллаж\nвсе элементы Дуб Честерфилд ","2000х400х2100",null,31916]
["EVL908","EVL908/ANT/ANT/ANT.U003","Тумба-стеллаж разделительный\nглубиной 420\nКорпус и фасады Антрацит, средний топ Дуб Честерфилд, ручки Антрацит. ","1650х420х1600",null,43743]
[null,"EVL442.U003","Стеллаж боковой высокий.\nКорпус, полки, задняя стенка - Дуб Честерфилд\n  ","320х344х2035",null,10011]
[null,"EVL443/U003.U003","Стеллаж промежуточный высокий.\nКорпус, полки - Дуб Честерфилд, задняя стенка - Антрацит. ","600х344х2052",null,15936]
[null,"EVL444/ANT.U003","Стеллаж промежуточный высокий.\nКорпус, полки - Дуб Честерфилд, задняя стенка - Антрацит. ","450х344х2052",null,13868]
["EVL441","EVL441.U003","Стеллаж боковой средний.\nКорпус, полки, задняя стенка - Дуб Честерфилд. ","320х344х1233",null,6352]
["EVL445","EVL445/ANT.U003","Стеллаж промежуточный средний. Корпус, полки  - Дуб Честерфилд, задняя стенка - Антрацит. ","600х344х1233",null,9288.4000000000015]
["EVL446","EVL446/ANT.U003","Стеллаж промежуточный средний. Корпус, полки  - Дуб Честерфилд, задняя стенка - Антрацит. ","450х344х1233",null,8554]
[null,"EVL450/U003/ANT.U003","Миникухня.\nПолностью Дуб Честерфилд.\nЗадняя стенка - Антрацит.","1000х620х2150",null,31920]
[]
[null,"EVL992.ANT","Цветочница, цвет Антрацит ","720х410x200",null,2393]
[null,"Программа под заказ (Скидки на остатки в наличии)"]
[null,"Артикул","Наименование","Размеры Ш*Г*В (мм)","Изображение","Розничная Цена","Розничная  цена со скидкой*"]
[null,"EVL822/П/60х30/ANT/ANT.U003","Стол для переговоров \n2,2 м. на металлических опорах","2200x1000x750   ",null,{"$f":"ROUND(24260.5*0.56,0)","v":13586},{"$f":"ROUND(F110*0.75,0)","v":10190}]
[null,"EVL822/А/60х30/ANT/ANT.U003",null,"2200x1000x750   ",null,{"$f":"ROUND(24267.1*0.56,0)","v":13590},{"$f":"ROUND(F111*0.75,0)","v":10193}]
[null,"EVL822/О/60х30/ANT/ANT.U003",null,"2200x1000x750   ",null,{"$f":"ROUND(25348.4*0.56,0)","v":14195},10646]
[null,"EVL290/ANT.ANT","Контейнер подвесной с 1 ящиком Тип - 1\n(замок на ящик)\nФасады, корпус - Антрацит, ручки Антрацит","448х478х208",null,5163,{"$f":"ROUND(F113*0.75,0)","v":3872}]
[null,"EVL291/ANT.ANT","Контейнер подвесной с 2 ящиками Тип - 1\n(замок на верхний ящик)\nФасады, корпус - Антрацит, ручки Антрацит","448х478х346",null,7469,{"$f":"ROUND(F114*0.75,0)","v":5602}]
[null,"Указана финальная цена с максимальной скидкой, действует до тех пор, пока позиция есть в наличии."]
[]
[null,"Экраны и фронтали"]
[null,"Фронтальные экраны ЛДСП в цв. Антрацит и Белый с креплением AKS166(Комплект кронштейнов для крепления фронтальных надстольных экранов к рабочему столу)",null,null,null,"Розничная Цена (руб.)"]
[null,null,null,null,null,1164,"Цвет Антрацит"]
[null,null,null,null,null,1164,"Белый цвет"]
[null,"Для удобства клиентов цены изделий указаны вместе с креплением→ \n(в отгрузочных документах экран и крепление прописываются отдельно)",null,null,null,"Розничная цена изделия без крепления (руб)","Розничная цена с креплением (руб.)"]
["EVL501W.ANT","EVL501W.ANT+AKS166","Экран стола 1200, ЛДСП в цв. Антрацит + крепление AKS166 (Антрацит)","1200х383х18",null,2700.5,{"$f":"F122+F119","v":3864.5}]
["EVL501W.H","EVL501W.H+AKS166","Экран стола 1200, ЛДСП в белом цвете + крепление AKS166 (Белый)","1200х383х18",null,2700.5,{"$f":"F123+F120","v":3864.5}]
["EVL503W.ANT","EVL503W.ANT+AKS166","Экран стола 1400, ЛДСП в цв. Антрацит + крепление AKS166 (Антрацит)","1400х383х18",null,3132.8,{"$f":"F124+F119","v":4296.8}]
["EVL503W.H","EVL503W.H+AKS166","Экран стола 1400, ЛДСП в белом цвете + крепление AKS166 (Белый)","1400х383х18",null,3132.8,{"$f":"F125+F120","v":4296.8}]
["EVL505W.ANT","EVL505W.ANT+AKS166","Экран стола 1600, ЛДСП в цв. Антрацит + крепление AKS166 (Антрацит)","1600х383х18",null,3723.5000000000005,{"$f":"F126+F119","v":4887.5}]
["EVL505W.H","EVL505W.H+AKS166","Экран стола 1600, ЛДСП в белом цвете + крепление AKS166 (Белый)","1600х383х18",null,3723.5000000000005,{"$f":"F127+F120","v":4887.5}]
[null,"Тканевые фронтальные экраны для одиночного стола в цвете Grey с креплением AKS166(Комплект кронштейнов для крепления фронтальных надстольных экранов к рабочему столу) в цв. Антрацит",null,null,null,"Розничная Цена (руб.)"]
[null,null,null,null,null,1164,"Цвет Антрацит"]
[null,"Для удобства клиентов цены изделий указаны вместе с креплением→ \n(в отгрузочных документах экран и крепление прописываются отдельно)",null,null,null,"Розничная цена изделия без крепления (руб)","Розничная цена с креплением (руб.)"]
["EVL501.2","EVL501.2+AKS166","Экран стола 1200, ткань + крепление AKS166 ","1200х383х22",null,4243,{"$f":"F131+F129","v":5407}]
["EVL503.2","EVL503.2+AKS166","Экран стола 1400, ткань + крепление AKS166","1400х383х22",null,4587,{"$f":"F132+F129","v":5751}]
["EVL505.2","EVL505.2+AKS166","Экран стола 1600, ткань + крепление AKS166","1600х383х22",null,6184,{"$f":"F133+F129","v":7348}]
[null,"Тканевые фронтальные экраны для одиночного стола в цвете Mint с креплением AKS166(Комплект кронштейнов для крепления фронтальных надстольных экранов к рабочему столу) в цв. Антрацит",null,null,null,"Розничная Цена (руб.)"]
[null,null,null,null,null,1164,"Цвет Антрацит"]
[null,"Для удобства клиентов цены изделий указаны вместе с креплением→ \n(в отгрузочных документах экран и крепление прописываются отдельно)",null,null,null,"Розничная цена изделия без крепления (руб)","Розничная цена с креплением (руб.)"]
["EVL501.MNT","EVL501.MNT+AKS166","Экран стола 1200, ткань + крепление AKS166 ","1200х383х22",null,4243,{"$f":"F137+F135","v":5407}]
["EVL503.MNT","EVL503.MNT+AKS166","Экран стола 1400, ткань + крепление AKS166","1400х383х22",null,4587,{"$f":"F138+F135","v":5751}]
["EVL505.MNT","EVL505.MNT+AKS166","Экран стола 1600, ткань + крепление AKS166","1600х383х22",null,6184,{"$f":"F139+F135","v":7348}]
[null,"Фронтальные экраны ЛДСП в цв. Антрацит и Белый с креплением AKS165(Комплект кронштейнов \nсо штырём для крепления экрана к бенчу) в соответствующем цвете",null,null,null,"Розничная Цена (руб.)"]
[null,null,null,null,null,1240,"Цвет Антрацит"]
[null,null,null,null,null,1240,"Белый цвет"]
[null,"Для удобства клиентов цены изделий указаны вместе с креплением→ \n(в отгрузочных документах экран и крепление прописываются отдельно)",null,null,null,"Розничная цена изделия без крепления (руб)","Розничная цена с креплением (руб.)"]
["EVL501W.ANT","EVL501W.ANT+AKS165","Экран бенча 1200, ЛДСП в цв. Антрацит + крепление AKS165 (Антрацит)","1200х383х18",null,2700.5,{"$f":"F141+F144","v":3940.5}]
["EVL501W.H","EVL501W.H+AKS165","Экран бенча 1200, ЛДСП в белом цвете + крепление AKS165 (Белый)","1200х383х18",null,2700.5,{"$f":"F145+F142","v":3940.5}]
["EVL503W.ANT","EVL503W.ANT+AKS165","Экран бенча 1400, ЛДСП в цв. Антрацит + крепление AKS165 (Антрацит)","1400х383х18",null,3132.8,{"$f":"F146+F141","v":4372.8}]
["EVL503W.H","EVL503W.H+AKS165","Экран бенча 1400, ЛДСП в белом цвете + крепление AKS165 (Белый)","1400х383х18",null,3132.8,{"$f":"F147+F142","v":4372.8}]
["EVL505W.ANT","EVL505W.ANT+AKS165","Экран бенча 1600, ЛДСП в цв. Антрацит + крепление AKS165 (Антрацит)","1600х383х18",null,3723.5000000000005,{"$f":"F148+F141","v":4963.5}]
["EVL505W.H","EVL505W.H+AKS165","Экран бенча 1600, ЛДСП в белом цвете + крепление AKS165 (Белый)","1600х383х18",null,3723.5000000000005,{"$f":"F149+F142","v":4963.5}]
[null,"Тканевые фронтальные экраны для бенчей в цвете Grey  с креплением AKS165 (Комплект кронштейнов двойных со штырём для крепления экрана к бенчу) в цв. Антрацит",null,null,null,"Розничная Цена (руб.)"]
[null,null,null,null,null,1240,"Цвет Антрацит"]
[null,"Для удобства клиентов цены изделий указаны вместе с креплением→ \n(в отгрузочных документах экран и крепление прописываются отдельно)",null,null,null,"Розничная цена изделия без крепления (руб)","Розничная цена с креплением (руб.)"]
["EVL501.2","EVL501.2+AKS165","Экран стола 1200, ткань + крепление AKS165 ","1200х383х22",null,4243,{"$f":"F153+F151","v":5483}]
["EVL503.2","EVL503.2+AKS165","Экран стола 1400, ткань + крепление AKS165","1400х383х22",null,4587,{"$f":"F154+F151","v":5827}]
["EVL505.2","EVL505.2+AKS165","Экран стола 1600, ткань + крепление AKS165","1600х383х22",null,6184,{"$f":"F155+F151","v":7424}]
[null,"Тканевые фронтальные экраны для бенчей в цвете Mint с креплением AKS165\n(Комплект кронштейнов двойных со штырём для крепления экрана к бенчу) в цв. Антрацит",null,null,null,"Розничная Цена (руб.)"]
[null,null,null,null,null,1240,"Цвет Антрацит"]
[null,"Для удобства клиентов цены изделий указаны вместе с креплением→ \n(в отгрузочных документах экран и крепление прописываются отдельно)",null,null,null,"Розничная цена изделия без крепления (руб)","Розничная цена с креплением (руб.)"]
["EVL501.MNT","EVL501.MNT+AKS165","Экран стола 1200, ткань + крепление AKS165 ","1200х383х22",null,4243,{"$f":"F159+F157","v":5483}]
["EVL503.MNT","EVL503.MNT+AKS165","Экран стола 1400, ткань + крепление AKS165","1400х383х22",null,4587,{"$f":"F160+F157","v":5827}]
["EVL505.MNT","EVL505.MNT+AKS165","Экран стола 1600, ткань + крепление AKS165","1600х383х22",null,6184,{"$f":"F161+F157","v":7424}]
[null,null,null,null,null,"Розничная Цена (руб.)"]
[null,null,null,null,null,2723,"Цвет Антрацит"]
[null,null,"Для удобства клиентов цены изделий указаны вместе с креплением \n(в отгрузочных документах экран и крепление прописываются отдельно)↓",null,null,"Розничная цена изделия без крепления (руб)","Розничная цена с креплением (руб.)"]
["EVL500.2","EVL500.2+AKS161.ANT","Экран-фронталь для одиночного стола 1200 (ткань)  с креплением AKS161 ","1050х750х22",null,6811,{"$f":"F165+F163","v":9534}]
["EVL502.2","EVL502.2+AKS161.ANT","Экран-фронталь для одиночного стола 1400 (ткань)  с креплением AKS161","1250х750х22",null,7291,{"$f":"F166+F163","v":10014}]
[]
[null,"Тканевый торцевой экран с комплектом креплений  AKS177\n (для торцевых экранов)",null,null,null,"Розничная Цена (руб.)"]
[null,null,null,null,null,2874,"Цвет Антрацит"]
["Для удобства клиентов цены изделий указаны вместе с креплением \n(в отгрузочных документах экран и крепление прописываются отдельно)→",null,null,null,null,"Розничная цена изделия без крепления (руб)","Розничная цена с креплением (руб.)"]
["EVL509.2","EVL509.2+AKS177.ANT","Экран торцевой 700, ткань, с креплением AKS167  ","700х350х22",null,3254,{"$f":"F171+F169","v":6128}]
[]
[null,"Торцевый экран ЛДСП с комплектом креплений  AKS177\n (для торцевых экранов)",null,null,null,"Розничная Цена (руб.)"]
[null,null,null,null,null,2874,"Цвет Антрацит"]
[null,"Для удобства клиентов цены изделий указаны вместе с креплением \n(в отгрузочных документах экран и крепление прописываются отдельно)→",null,null,null,"Розничная цена изделия без крепления (руб)","Розничная цена с креплением (руб.)"]
["EVL509W.ANT","EVL509W.ANT+AKS177.ANT","Экран торцевой 700, ЛДСП, с креплением AKS167  ","700х350х18",null,1395.9,{"$f":"F176+F174","v":4269.8999999999996}]
[]
[null,"Фронталь скромности стола в цв. Антрацит с креплением AKS168 (165х35х82 - каждый)",null,null,"Комплект держателей для фронтали скромности \nлюбого размера",1041,"Цвет Антрацит "]
[null,"Для удобства клиентов цены изделий указаны вместе с креплением→ \n(в отгрузочных документах экран и крепление прописываются отдельно)",null,null,null,"Розничная цена изделия без крепления (руб)","Розничная цена с креплением (руб.)"]
["EVL140.ANT","EVL140.ANT+AKS168","Фронталь скромности стола 1200 мм в цв. Антрацит \n+ крепление AKS168 ","1050х315х18",null,1375,{"$f":"F180+F178","v":2416}]
["EVL140.H","EVL140.H+AKS168","Фронталь скромности стола 1200 мм в Белом цвете \n+ крепление AKS168 ","1050х315х18",null,1375,{"$f":"F181+F178","v":2416}]
["EVL141.ANT","EVL141.ANT+AKS168","Фронталь скромности стола 1400 мм в цв. Антрацит\n+ крепление AKS168 ","1250х315х18",null,1444,{"$f":"F182+F178","v":2485}]
["EVL141.H","EVL141.HAKS168","Фронталь скромности стола 1400 мм в Белом цвете\n+ крепление AKS168 ","1250х315х18",null,1575,{"$f":"F183+F178","v":2616}]
["EVL142.ANT","EVL142.ANT+AKS168","Фронталь скромности стола 1600 мм в цв. Антрацит\n+ крепление AKS168 ","1450х315х18",null,1778,{"$f":"F184+F178","v":2819}]
["EVL142.H","EVL142.H+AKS168","Фронталь скромности стола 1600 мм в Белом цвете\n+ крепление AKS168 ","1450х315х18",null,1798,{"$f":"F185+F178","v":2839}]
[]
[null,"Кабель-каналы и вставки в бенчи",null,null,null,"Розничная Цена (руб.)"]
["AKS170.ANT","AKS170.ANT","Кабель канал узкий с креплением к столешнице","1000х90х55h\n(для стола 1,2 м.)",null,2369]
["AKS171.ANT","AKS171.ANT",null,"1200х90х55h\n(для стола 1,4 м.)",null,2443]
["AKS172.ANT","AKS172.ANT",null,"1400х90х55h\n(для стола 1,6 м.)",null,2854]
["EVL551.ANT","EVL551.ANT","Вставка для бенчей шириной 1200 мм. ЛДСП и крепление в цв. Антрацит","1200х40х25",null,1360]
["EVL552.ANT","EVL552.ANT","Вставка для бенчей шириной 1400 мм. ЛДСП и крепление в цв. Антрацит","1400х40х25",null,1404]
["EVL553.ANT","EVL553.ANT","Вставка для бенчей шириной 1600 мм. ЛДСП и крепление в цв. Антрацит","1600х40х25",null,1518]

{"sheet":"Столы на ДСП опорах","index":1,"n_rows":56,"n_cols":13,"rows_kept":56,"cut":false,"hidden":false,"merged":[[42,2,45,2],[38,2,41,2],[34,2,37,2],[49,6,49,7],[34,4,37,4],[34,3,35,3],[38,4,41,4],[42,4,45,4],[42,5,43,5],[44,5,45,5],[0,9,1,12],[1,1,1,5],[2,1,3,5],[20,3,21,3],[22,3,23,3],[20,2,23,2],[20,4,23,4],[20,5,21,5],[22,5,23,5],[5,2,8,2],[9,2,13,2],[14,2,18,2],[14,4,18,4],[5,4,8,4],[24,5,25,5],[49,1,51,1],[40,3,41,3],[42,3,43,3],[44,3,45,3],[32,3,33,3],[36,3,37,3],[9,4,13,4],[30,2,33,2],[30,4,33,4],[28,3,29,3],[38,3,39,3],[24,2,29,2],[24,4,29,4],[24,3,25,3],[26,3,27,3],[30,3,31,3],[36,5,37,5],[38,5,39,5],[40,5,41,5],[26,5,27,5],[32,5,33,5],[34,5,35,5],[28,5,29,5],[30,5,31,5]]}
[null,"EVOLUTION",null,null,null,{"$f":"Склаская!F1","v":"2025-05-23"},null,null,null,"Формирование артикула \nв зависимости от выбранных характеристик"]
[null,"Столы на ЛДСП опорах: толщина столешницы 25 мм, толщина опор и фронтали стола 18 мм."]
[null,"Не складская программа производятся на заказ партией от 6 шт., со сроком по согласованию с производством, в цвете: \nДуб Честерфилд, Белый, Антрацит, Серый R2, Дуб 131, Серый камень, Венге Цаво, Бетон. \nДля заказа изделия следует пользоваться правилами кодировки для создания  артикула.  →→→",null,null,null,null,null,null,null,"Цвет опор","Цвет фронтали (передней панели)","Цвет заглушки кабель-канала","Цвет столешницы"]
[null,null,null,null,null,null,null,null,null,"Дуб Честерфилд","Антрацит","Антрацит","Дуб Честерфилд"]
[null,"Артикул","Наименование","Размеры Ш*Г*В (мм)","Изображение","Розничная Цена, руб."]
["EVL150",{"$f":"CONCATENATE(A6,\"/\",VLOOKUP($J$4,'Цвет корпуса шкафа'!A:B,2,0),\"/\",VLOOKUP($K$4,'Цвет корпуса шкафа'!A:B,2,0),\"/\",VLOOKUP($L$4,'Цвет лючка'!A:B,2,0),\".\",VLOOKUP($M$4,'Цвет столешницы'!A:B,2,FALSE))","v":"EVL150/U003/ANT/ANT.U003"},"Стол письменный на ДСП опорах шириной 600 мм","1000*600*750",null,9244]
["EVL151",{"$f":"CONCATENATE(A7,\"/\",VLOOKUP($J$4,'Цвет корпуса шкафа'!A:B,2,0),\"/\",VLOOKUP($K$4,'Цвет корпуса шкафа'!A:B,2,0),\"/\",VLOOKUP($L$4,'Цвет лючка'!A:B,2,0),\".\",VLOOKUP($M$4,'Цвет столешницы'!A:B,2,FALSE))","v":"EVL151/U003/ANT/ANT.U003"},null,"1200*600*750",null,9978]
["EVL152",{"$f":"CONCATENATE(A8,\"/\",VLOOKUP($J$4,'Цвет корпуса шкафа'!A:B,2,0),\"/\",VLOOKUP($K$4,'Цвет корпуса шкафа'!A:B,2,0),\"/\",VLOOKUP($L$4,'Цвет лючка'!A:B,2,0),\".\",VLOOKUP($M$4,'Цвет столешницы'!A:B,2,FALSE))","v":"EVL152/U003/ANT/ANT.U003"},null,"1400*600*750",null,10079]
["EVL153",{"$f":"CONCATENATE(A9,\"/\",VLOOKUP($J$4,'Цвет корпуса шкафа'!A:B,2,0),\"/\",VLOOKUP($K$4,'Цвет корпуса шкафа'!A:B,2,0),\"/\",VLOOKUP($L$4,'Цвет лючка'!A:B,2,0),\".\",VLOOKUP($M$4,'Цвет столешницы'!A:B,2,FALSE))","v":"EVL153/U003/ANT/ANT.U003"},null,"1600*600*750",null,11386]
["EVL154",{"$f":"CONCATENATE(A10,\"/\",VLOOKUP($J$4,'Цвет корпуса шкафа'!A:B,2,0),\"/\",VLOOKUP($K$4,'Цвет корпуса шкафа'!A:B,2,0),\"/\",VLOOKUP($L$4,'Цвет лючка'!A:B,2,0),\".\",VLOOKUP($M$4,'Цвет столешницы'!A:B,2,FALSE))","v":"EVL154/U003/ANT/ANT.U003"},"Стол письменный на ДСП опорах шириной 700 мм","1000*700*750",null,9779]
["EVL155",{"$f":"CONCATENATE(A11,\"/\",VLOOKUP($J$4,'Цвет корпуса шкафа'!A:B,2,0),\"/\",VLOOKUP($K$4,'Цвет корпуса шкафа'!A:B,2,0),\"/\",VLOOKUP($L$4,'Цвет лючка'!A:B,2,0),\".\",VLOOKUP($M$4,'Цвет столешницы'!A:B,2,FALSE))","v":"EVL155/U003/ANT/ANT.U003"},null,"1200*700*750",null,9793]
["EVL156",{"$f":"CONCATENATE(A12,\"/\",VLOOKUP($J$4,'Цвет корпуса шкафа'!A:B,2,0),\"/\",VLOOKUP($K$4,'Цвет корпуса шкафа'!A:B,2,0),\"/\",VLOOKUP($L$4,'Цвет лючка'!A:B,2,0),\".\",VLOOKUP($M$4,'Цвет столешницы'!A:B,2,FALSE))","v":"EVL156/U003/ANT/ANT.U003"},null,"1400*700*750",null,10523]
["EVL157",{"$f":"CONCATENATE(A13,\"/\",VLOOKUP($J$4,'Цвет корпуса шкафа'!A:B,2,0),\"/\",VLOOKUP($K$4,'Цвет корпуса шкафа'!A:B,2,0),\"/\",VLOOKUP($L$4,'Цвет лючка'!A:B,2,0),\".\",VLOOKUP($M$4,'Цвет столешницы'!A:B,2,FALSE))","v":"EVL157/U003/ANT/ANT.U003"},null,"1600*700*750",null,11189]
["EVL158",{"$f":"CONCATENATE(A14,\"/\",VLOOKUP($J$4,'Цвет корпуса шкафа'!A:B,2,0),\"/\",VLOOKUP($K$4,'Цвет корпуса шкафа'!A:B,2,0),\"/\",VLOOKUP($L$4,'Цвет лючка'!A:B,2,0),\".\",VLOOKUP($M$4,'Цвет столешницы'!A:B,2,FALSE))","v":"EVL158/U003/ANT/ANT.U003"},null,"1800*700*750",null,13239]
["EVL159",{"$f":"CONCATENATE(A15,\"/\",VLOOKUP($J$4,'Цвет корпуса шкафа'!A:B,2,0),\"/\",VLOOKUP($K$4,'Цвет корпуса шкафа'!A:B,2,0),\"/\",VLOOKUP($L$4,'Цвет лючка'!A:B,2,0),\".\",VLOOKUP($M$4,'Цвет столешницы'!A:B,2,FALSE))","v":"EVL159/U003/ANT/ANT.U003"},"Стол письменный на ДСП опорах  шириной 800 мм","1000*800*750",null,10969]
["EVL160",{"$f":"CONCATENATE(A16,\"/\",VLOOKUP($J$4,'Цвет корпуса шкафа'!A:B,2,0),\"/\",VLOOKUP($K$4,'Цвет корпуса шкафа'!A:B,2,0),\"/\",VLOOKUP($L$4,'Цвет лючка'!A:B,2,0),\".\",VLOOKUP($M$4,'Цвет столешницы'!A:B,2,FALSE))","v":"EVL160/U003/ANT/ANT.U003"},null,"1200*800*750",null,11320]
["EVL161",{"$f":"CONCATENATE(A17,\"/\",VLOOKUP($J$4,'Цвет корпуса шкафа'!A:B,2,0),\"/\",VLOOKUP($K$4,'Цвет корпуса шкафа'!A:B,2,0),\"/\",VLOOKUP($L$4,'Цвет лючка'!A:B,2,0),\".\",VLOOKUP($M$4,'Цвет столешницы'!A:B,2,FALSE))","v":"EVL161/U003/ANT/ANT.U003"},null,"1400*800*750",null,12198]
["EVL162",{"$f":"CONCATENATE(A18,\"/\",VLOOKUP($J$4,'Цвет корпуса шкафа'!A:B,2,0),\"/\",VLOOKUP($K$4,'Цвет корпуса шкафа'!A:B,2,0),\"/\",VLOOKUP($L$4,'Цвет лючка'!A:B,2,0),\".\",VLOOKUP($M$4,'Цвет столешницы'!A:B,2,FALSE))","v":"EVL162/U003/ANT/ANT.U003"},null,"1600*800*750",null,13534]
["EVL163",{"$f":"CONCATENATE(A19,\"/\",VLOOKUP($J$4,'Цвет корпуса шкафа'!A:B,2,0),\"/\",VLOOKUP($K$4,'Цвет корпуса шкафа'!A:B,2,0),\"/\",VLOOKUP($L$4,'Цвет лючка'!A:B,2,0),\".\",VLOOKUP($M$4,'Цвет столешницы'!A:B,2,FALSE))","v":"EVL163/U003/ANT/ANT.U003"},null,"1800*800*750",null,14729]
["EVL164",{"$f":"CONCATENATE(A20,\"/\",VLOOKUP($J$4,'Цвет корпуса шкафа'!A:B,2,0),\"/\",VLOOKUP($K$4,'Цвет корпуса шкафа'!A:B,2,0),\"/\",VLOOKUP($L$4,'Цвет лючка'!A:B,2,0),\".\",VLOOKUP($M$4,'Цвет столешницы'!A:B,2,FALSE))","v":"EVL164/U003/ANT/ANT.U003"},"Стол письменный на ДСП опорах, шириной 900 мм","1800*900*750",null,17516]
["EVL165SX",{"$f":"CONCATENATE(A21,\"/\",VLOOKUP($J$4,'Цвет корпуса шкафа'!A:B,2,0),\"/\",VLOOKUP($K$4,'Цвет корпуса шкафа'!A:B,2,0),\"/\",VLOOKUP($L$4,'Цвет лючка'!A:B,2,0),\".\",VLOOKUP($M$4,'Цвет столешницы'!A:B,2,FALSE))","v":"EVL165SX/U003/ANT/ANT.U003"},"Стол криволинейный левый/правый на ДСП опорах, \nглубиной 600/900 мм","1200*900*750","правый",11766]
["EVL165DX",{"$f":"CONCATENATE(A22,\"/\",VLOOKUP($J$4,'Цвет корпуса шкафа'!A:B,2,0),\"/\",VLOOKUP($K$4,'Цвет корпуса шкафа'!A:B,2,0),\"/\",VLOOKUP($L$4,'Цвет лючка'!A:B,2,0),\".\",VLOOKUP($M$4,'Цвет столешницы'!A:B,2,FALSE))","v":"EVL165DX/U003/ANT/ANT.U003"}]
["EVL166SX",{"$f":"CONCATENATE(A23,\"/\",VLOOKUP($J$4,'Цвет корпуса шкафа'!A:B,2,0),\"/\",VLOOKUP($K$4,'Цвет корпуса шкафа'!A:B,2,0),\"/\",VLOOKUP($L$4,'Цвет лючка'!A:B,2,0),\".\",VLOOKUP($M$4,'Цвет столешницы'!A:B,2,FALSE))","v":"EVL166SX/U003/ANT/ANT.U003"},null,"1400*900*750",null,12792]
["EVL166DX",{"$f":"CONCATENATE(A24,\"/\",VLOOKUP($J$4,'Цвет корпуса шкафа'!A:B,2,0),\"/\",VLOOKUP($K$4,'Цвет корпуса шкафа'!A:B,2,0),\"/\",VLOOKUP($L$4,'Цвет лючка'!A:B,2,0),\".\",VLOOKUP($M$4,'Цвет столешницы'!A:B,2,FALSE))","v":"EVL166DX/U003/ANT/ANT.U003"}]
["EVL167SX",{"$f":"CONCATENATE(A25,\"/\",VLOOKUP($J$4,'Цвет корпуса шкафа'!A:B,2,0),\"/\",VLOOKUP($K$4,'Цвет корпуса шкафа'!A:B,2,0),\"/\",VLOOKUP($L$4,'Цвет лючка'!A:B,2,0),\".\",VLOOKUP($M$4,'Цвет столешницы'!A:B,2,FALSE))","v":"EVL167SX/U003/ANT/ANT.U003"},"Стол криволинейный левый/правый на ДСП опорах, \nглубиной 700/900 мм","1200*900*750","правый",10480]
["EVL167DX",{"$f":"CONCATENATE(A26,\"/\",VLOOKUP($J$4,'Цвет корпуса шкафа'!A:B,2,0),\"/\",VLOOKUP($K$4,'Цвет корпуса шкафа'!A:B,2,0),\"/\",VLOOKUP($L$4,'Цвет лючка'!A:B,2,0),\".\",VLOOKUP($M$4,'Цвет столешницы'!A:B,2,FALSE))","v":"EVL167DX/U003/ANT/ANT.U003"}]
["EVL168SX",{"$f":"CONCATENATE(A27,\"/\",VLOOKUP($J$4,'Цвет корпуса шкафа'!A:B,2,0),\"/\",VLOOKUP($K$4,'Цвет корпуса шкафа'!A:B,2,0),\"/\",VLOOKUP($L$4,'Цвет лючка'!A:B,2,0),\".\",VLOOKUP($M$4,'Цвет столешницы'!A:B,2,FALSE))","v":"EVL168SX/U003/ANT/ANT.U003"},null,"1400*900*750",null,10804]
["EVL168DX",{"$f":"CONCATENATE(A28,\"/\",VLOOKUP($J$4,'Цвет корпуса шкафа'!A:B,2,0),\"/\",VLOOKUP($K$4,'Цвет корпуса шкафа'!A:B,2,0),\"/\",VLOOKUP($L$4,'Цвет лючка'!A:B,2,0),\".\",VLOOKUP($M$4,'Цвет столешницы'!A:B,2,FALSE))","v":"EVL168DX/U003/ANT/ANT.U003"}]
["EVL169SX",{"$f":"CONCATENATE(A29,\"/\",VLOOKUP($J$4,'Цвет корпуса шкафа'!A:B,2,0),\"/\",VLOOKUP($K$4,'Цвет корпуса шкафа'!A:B,2,0),\"/\",VLOOKUP($L$4,'Цвет лючка'!A:B,2,0),\".\",VLOOKUP($M$4,'Цвет столешницы'!A:B,2,FALSE))","v":"EVL169SX/U003/ANT/ANT.U003"},null,"1600*900*750",null,13190]
["EVL169DX",{"$f":"CONCATENATE(A30,\"/\",VLOOKUP($J$4,'Цвет корпуса шкафа'!A:B,2,0),\"/\",VLOOKUP($K$4,'Цвет корпуса шкафа'!A:B,2,0),\"/\",VLOOKUP($L$4,'Цвет лючка'!A:B,2,0),\".\",VLOOKUP($M$4,'Цвет столешницы'!A:B,2,FALSE))","v":"EVL169DX/U003/ANT/ANT.U003"}]
["EVL170SX",{"$f":"CONCATENATE(A31,\"/\",VLOOKUP($J$4,'Цвет корпуса шкафа'!A:B,2,0),\"/\",VLOOKUP($K$4,'Цвет корпуса шкафа'!A:B,2,0),\"/\",VLOOKUP($L$4,'Цвет лючка'!A:B,2,0),\".\",VLOOKUP($M$4,'Цвет столешницы'!A:B,2,FALSE))","v":"EVL170SX/U003/ANT/ANT.U003"},"Стол криволинейный левый/правый на ДСП опорах, \nглубиной 800/900 мм","1400*900*750","правый",13341]
["EVL170DX",{"$f":"CONCATENATE(A32,\"/\",VLOOKUP($J$4,'Цвет корпуса шкафа'!A:B,2,0),\"/\",VLOOKUP($K$4,'Цвет корпуса шкафа'!A:B,2,0),\"/\",VLOOKUP($L$4,'Цвет лючка'!A:B,2,0),\".\",VLOOKUP($M$4,'Цвет столешницы'!A:B,2,FALSE))","v":"EVL170DX/U003/ANT/ANT.U003"}]
["EVL171SX",{"$f":"CONCATENATE(A33,\"/\",VLOOKUP($J$4,'Цвет корпуса шкафа'!A:B,2,0),\"/\",VLOOKUP($K$4,'Цвет корпуса шкафа'!A:B,2,0),\"/\",VLOOKUP($L$4,'Цвет лючка'!A:B,2,0),\".\",VLOOKUP($M$4,'Цвет столешницы'!A:B,2,FALSE))","v":"EVL171SX/U003/ANT/ANT.U003"},null,"1600*900*750",null,14257]
["EVL171DX",{"$f":"CONCATENATE(A34,\"/\",VLOOKUP($J$4,'Цвет корпуса шкафа'!A:B,2,0),\"/\",VLOOKUP($K$4,'Цвет корпуса шкафа'!A:B,2,0),\"/\",VLOOKUP($L$4,'Цвет лючка'!A:B,2,0),\".\",VLOOKUP($M$4,'Цвет столешницы'!A:B,2,FALSE))","v":"EVL171DX/U003/ANT/ANT.U003"}]
["EVL172SX",{"$f":"CONCATENATE(A35,\"/\",VLOOKUP($J$4,'Цвет корпуса шкафа'!A:B,2,0),\"/\",VLOOKUP($K$4,'Цвет корпуса шкафа'!A:B,2,0),\"/\",VLOOKUP($L$4,'Цвет лючка'!A:B,2,0),\".\",VLOOKUP($M$4,'Цвет столешницы'!A:B,2,FALSE))","v":"EVL172SX/U003/ANT/ANT.U003"},"Стол криволинейный левый/правый на ДСП опорах","1400*1200*750","левый",16129]
["EVL172DX",{"$f":"CONCATENATE(A36,\"/\",VLOOKUP($J$4,'Цвет корпуса шкафа'!A:B,2,0),\"/\",VLOOKUP($K$4,'Цвет корпуса шкафа'!A:B,2,0),\"/\",VLOOKUP($L$4,'Цвет лючка'!A:B,2,0),\".\",VLOOKUP($M$4,'Цвет столешницы'!A:B,2,FALSE))","v":"EVL172DX/U003/ANT/ANT.U003"}]
["EVL173SX",{"$f":"CONCATENATE(A37,\"/\",VLOOKUP($J$4,'Цвет корпуса шкафа'!A:B,2,0),\"/\",VLOOKUP($K$4,'Цвет корпуса шкафа'!A:B,2,0),\"/\",VLOOKUP($L$4,'Цвет лючка'!A:B,2,0),\".\",VLOOKUP($M$4,'Цвет столешницы'!A:B,2,FALSE))","v":"EVL173SX/U003/ANT/ANT.U003"},null,"1600*1200*750",null,17466]
["EVL173DX",{"$f":"CONCATENATE(A38,\"/\",VLOOKUP($J$4,'Цвет корпуса шкафа'!A:B,2,0),\"/\",VLOOKUP($K$4,'Цвет корпуса шкафа'!A:B,2,0),\"/\",VLOOKUP($L$4,'Цвет лючка'!A:B,2,0),\".\",VLOOKUP($M$4,'Цвет столешницы'!A:B,2,FALSE))","v":"EVL173DX/U003/ANT/ANT.U003"}]
["EVL174SX",{"$f":"CONCATENATE(A39,\"/\",VLOOKUP($J$4,'Цвет корпуса шкафа'!A:B,2,0),\"/\",VLOOKUP($K$4,'Цвет корпуса шкафа'!A:B,2,0),\"/\",VLOOKUP($L$4,'Цвет лючка'!A:B,2,0),\".\",VLOOKUP($M$4,'Цвет столешницы'!A:B,2,FALSE))","v":"EVL174SX/U003/ANT/ANT.U003"},"Стол криволинейный левый/правый на ДСП опорах","1400*1200*750","левый",16324]
["EVL174DX",{"$f":"CONCATENATE(A40,\"/\",VLOOKUP($J$4,'Цвет корпуса шкафа'!A:B,2,0),\"/\",VLOOKUP($K$4,'Цвет корпуса шкафа'!A:B,2,0),\"/\",VLOOKUP($L$4,'Цвет лючка'!A:B,2,0),\".\",VLOOKUP($M$4,'Цвет столешницы'!A:B,2,FALSE))","v":"EVL174DX/U003/ANT/ANT.U003"}]
["EVL175SX",{"$f":"CONCATENATE(A41,\"/\",VLOOKUP($J$4,'Цвет корпуса шкафа'!A:B,2,0),\"/\",VLOOKUP($K$4,'Цвет корпуса шкафа'!A:B,2,0),\"/\",VLOOKUP($L$4,'Цвет лючка'!A:B,2,0),\".\",VLOOKUP($M$4,'Цвет столешницы'!A:B,2,FALSE))","v":"EVL175SX/U003/ANT/ANT.U003"},null,"1600*1200*750",null,17477]
["EVL175DX",{"$f":"CONCATENATE(A42,\"/\",VLOOKUP($J$4,'Цвет корпуса шкафа'!A:B,2,0),\"/\",VLOOKUP($K$4,'Цвет корпуса шкафа'!A:B,2,0),\"/\",VLOOKUP($L$4,'Цвет лючка'!A:B,2,0),\".\",VLOOKUP($M$4,'Цвет столешницы'!A:B,2,FALSE))","v":"EVL175DX/U003/ANT/ANT.U003"}]
["EVL176SX",{"$f":"CONCATENATE(A43,\"/\",VLOOKUP($J$4,'Цвет корпуса шкафа'!A:B,2,0),\"/\",VLOOKUP($K$4,'Цвет корпуса шкафа'!A:B,2,0),\"/\",VLOOKUP($L$4,'Цвет лючка'!A:B,2,0),\".\",VLOOKUP($M$4,'Цвет столешницы'!A:B,2,FALSE))","v":"EVL176SX/U003/ANT/ANT.U003"},"Стол криволинейный левый/правый на ДСП опорах","1400*1200*750","левый",16093]
["EVL176DX",{"$f":"CONCATENATE(A44,\"/\",VLOOKUP($J$4,'Цвет корпуса шкафа'!A:B,2,0),\"/\",VLOOKUP($K$4,'Цвет корпуса шкафа'!A:B,2,0),\"/\",VLOOKUP($L$4,'Цвет лючка'!A:B,2,0),\".\",VLOOKUP($M$4,'Цвет столешницы'!A:B,2,FALSE))","v":"EVL176DX/U003/ANT/ANT.U003"}]
["EVL177SX",{"$f":"CONCATENATE(A45,\"/\",VLOOKUP($J$4,'Цвет корпуса шкафа'!A:B,2,0),\"/\",VLOOKUP($K$4,'Цвет корпуса шкафа'!A:B,2,0),\"/\",VLOOKUP($L$4,'Цвет лючка'!A:B,2,0),\".\",VLOOKUP($M$4,'Цвет столешницы'!A:B,2,FALSE))","v":"EVL177SX/U003/ANT/ANT.U003"},null,"1600*1200*750",null,17488]
["EVL177DX",{"$f":"CONCATENATE(A46,\"/\",VLOOKUP($J$4,'Цвет корпуса шкафа'!A:B,2,0),\"/\",VLOOKUP($K$4,'Цвет корпуса шкафа'!A:B,2,0),\"/\",VLOOKUP($L$4,'Цвет лючка'!A:B,2,0),\".\",VLOOKUP($M$4,'Цвет столешницы'!A:B,2,FALSE))","v":"EVL177DX/U003/ANT/ANT.U003"}]
[]
[null,null,"Кодировка Артикула стола"]
[null,"Модель стола разворот стола /Цвет опор/Цв. фронтали/Цв. заглушки. Цвет столешницы  "]
[null,"МОДЕЛЬ СТОЛА (ФОРМА, РАЗМЕР)","ПРАВОСТОРОННИЙ /ЛЕВОСТОРОННИЙ","ЦВЕТ ОПОР","ЦВЕТ ФРОНТАЛИ","ЦВЕТ ЗАГЛУШКИ, РУЧЕК","ЦВЕТ СТОЛЕШНИЦЫ"]
[null,null,"SX-левый","АNT-АНТРАЦИТ","H                 Белый","АNT-АНТРАЦИТ","H","Белый"]
[null,null,"DX-правый","H-БЕЛЫЙ ","SLT             Салтилло","H-БЕЛЫЙ ","U727 ","Серый Камень"]
[null,null,null,"R2-СЕРЫЙ","R2               Серый","G-СЕРЫЙ","R2","Серый"]
[null,null,null,null,"ANT           Антрацит",null,"ANT","Антрацит"]
[null,null,null,null,"U003         Дуб Честерфилд",null,"U003","Дуб Честерфилд"]
[null,null,null,null,"L                 Дуб 131",null,"L","Дуб 131"]

{"sheet":"Столы на П-обр. 60х30","index":2,"n_rows":200,"n_cols":16,"rows_kept":200,"cut":false,"hidden":false,"merged":[[39,5,40,5],[171,1,171,4],[29,5,30,5],[31,5,32,5],[33,5,34,5],[35,5,36,5],[37,5,38,5],[98,2,102,2],[98,4,102,4],[68,2,70,2],[73,2,74,2],[73,4,74,4],[75,2,76,2],[75,4,76,4],[80,2,82,2],[80,4,82,4],[83,2,85,2],[83,4,85,4],[193,5,193,6],[159,2,161,2],[162,2,164,2],[162,4,164,4],[165,2,167,2],[165,4,167,4],[168,2,170,2],[168,4,170,4],[187,2,190,2],[187,4,190,4],[86,2,88,2],[86,4,88,4],[89,2,91,2],[89,4,91,4],[0,8,0,11],[1,1,1,4],[2,1,4,5],[6,2,9,2],[6,4,9,4],[15,2,19,2],[15,4,19,4],[39,3,40,3],[35,2,40,2],[35,4,40,4],[51,5,52,5],[49,5,50,5],[49,4,52,4],[45,2,48,2],[45,4,48,4],[41,5,42,5],[43,5,44,5],[92,2,94,2],[92,4,94,4],[2,8,2,10],[21,5,22,5],[23,5,24,5],[21,2,24,2],[25,3,26,3],[27,3,28,3],[25,5,26,5],[27,5,28,5],[21,4,24,4],[25,2,30,2],[29,3,30,3],[25,4,30,4],[31,3,32,3],[33,3,34,3],[31,4,34,4],[31,2,34,2],[35,3,36,3],[37,3,38,3],[96,2,97,2],[96,4,97,4],[65,2,67,2],[65,4,67,4],[68,4,70,4],[10,2,14,2],[10,4,14,4],[57,4,60,4],[57,2,60,2],[71,2,72,2],[71,4,72,4],[61,2,64,2],[61,4,64,4],[53,2,56,2],[53,4,56,4],[41,3,42,3],[43,3,44,3],[49,2,52,2],[51,3,52,3],[49,3,50,3],[77,2,79,2],[77,4,79,4],[21,3,22,3],[23,3,24,3],[147,4,149,4],[182,2,186,2],[182,4,186,4],[159,4,161,4],[172,2,176,2],[172,4,176,4],[177,2,181,2],[177,4,181,4],[150,2,152,2],[150,4,152,4],[153,2,155,2],[153,4,155,4],[103,2,107,2],[103,4,107,4],[108,2,112,2],[108,4,112,4],[113,2,117,2],[113,4,117,4],[156,2,158,2],[118,2,122,2],[118,4,122,4],[123,2,127,2],[123,4,127,4],[156,4,158,4],[141,2,143,2],[141,4,143,4],[144,2,146,2],[144,4,146,4],[138,4,140,4],[138,2,140,2],[128,2,133,2],[128,4,133,4],[135,2,137,2],[135,4,137,4],[134,1,134,4],[147,2,149,2],[41,2,44,2],[41,4,44,4],[45,3,46,3],[47,3,48,3],[45,5,46,5],[47,5,48,5]]}
[null,"EVOLUTION",null,null,null,{"$f":"Склаская!F1","v":"2025-05-23"},null,null,null,null,null,null,null,null,null," "]
[null,"Столы, бенчи и рабочие станции на металлокаркасе: П-образные опоры - прямоугольная труба с сечением 60*30мм, траверсы - труба 40*20мм."]
[null,"Не складская программа производятся на заказ партией от 6 шт., со сроком по согласованию с производством, в цвете: Дуб Честерфилд, Белый, Антрацит, Серый R2, Дуб 131, Серый камень, Венге Цаво, Бетон. \nОпоры столов в цв. Антрацит, Белый, Серый.\nЗаглушки кабель-каналов и ручки тумб Антрацит, Белый.\nДля заказа изделия следует пользоваться правилами кодировки для создания  артикула.  →→→",null,null,null,null,null,null,"Формирование артикула \nв зависимости от выбранных характеристик"]
[null,null,null,null,null,null,null,null,"Цвет мет. Опор","Цвет кабель-канала","Цвет столешницы"]
[null,null,null,null,null,null,null,null,"Антрацит","Антрацит","Дуб Честерфилд"]
[null,"Артикул","Наименование","Размеры Ш*Г*В (мм)","Изображение","Розничная Цена, руб."]
["EVL113/П/60*30/",{"$f":"CONCATENATE(A7,VLOOKUP($I$5,'Цвет мет. опор'!A:B,2,0),\"/\",VLOOKUP($J$5,'Цвет лючка'!A:B,2,0),\".\",VLOOKUP($K$5,'Цвет столешницы'!A:B,2,FALSE))","v":"EVL113/П/60*30/ANT/ANT.U003"},"Стол письменный на П образном м/к 60х30, глубиной 600 мм","1000*600*750",null,17745]
["EVL114/П/60*30/",{"$f":"CONCATENATE(A8,VLOOKUP($I$5,'Цвет мет. опор'!A:B,2,0),\"/\",VLOOKUP($J$5,'Цвет лючка'!A:B,2,0),\".\",VLOOKUP($K$5,'Цвет столешницы'!A:B,2,FALSE))","v":"EVL114/П/60*30/ANT/ANT.U003"},null,"1200*600*750",null,18312]
["EVL115/П/60*30/",{"$f":"CONCATENATE(A9,VLOOKUP($I$5,'Цвет мет. опор'!A:B,2,0),\"/\",VLOOKUP($J$5,'Цвет лючка'!A:B,2,0),\".\",VLOOKUP($K$5,'Цвет столешницы'!A:B,2,FALSE))","v":"EVL115/П/60*30/ANT/ANT.U003"},null,"1400*600*750",null,18862]
["EVL116/П/60*30/",{"$f":"CONCATENATE(A10,VLOOKUP($I$5,'Цвет мет. опор'!A:B,2,0),\"/\",VLOOKUP($J$5,'Цвет лючка'!A:B,2,0),\".\",VLOOKUP($K$5,'Цвет столешницы'!A:B,2,FALSE))","v":"EVL116/П/60*30/ANT/ANT.U003"},null,"1600*600*750",null,19680]
["EVL100/П/60*30/",{"$f":"CONCATENATE(A11,VLOOKUP($I$5,'Цвет мет. опор'!A:B,2,0),\"/\",VLOOKUP($J$5,'Цвет лючка'!A:B,2,0),\".\",VLOOKUP($K$5,'Цвет столешницы'!A:B,2,FALSE))","v":"EVL100/П/60*30/ANT/ANT.U003"},"Стол письменный на П образном м/к 60х30, глубиной 700 мм","1000*700*750",null,18269]
["EVL101/П/60*30/",{"$f":"CONCATENATE(A12,VLOOKUP($I$5,'Цвет мет. опор'!A:B,2,0),\"/\",VLOOKUP($J$5,'Цвет лючка'!A:B,2,0),\".\",VLOOKUP($K$5,'Цвет столешницы'!A:B,2,FALSE))","v":"EVL101/П/60*30/ANT/ANT.U003"},null,"1200*700*750",null,19220]
["EVL102/П/60*30/",{"$f":"CONCATENATE(A13,VLOOKUP($I$5,'Цвет мет. опор'!A:B,2,0),\"/\",VLOOKUP($J$5,'Цвет лючка'!A:B,2,0),\".\",VLOOKUP($K$5,'Цвет столешницы'!A:B,2,FALSE))","v":"EVL102/П/60*30/ANT/ANT.U003"},null,"1400*700*750",null,20072]
["EVL103/П/60*30/",{"$f":"CONCATENATE(A14,VLOOKUP($I$5,'Цвет мет. опор'!A:B,2,0),\"/\",VLOOKUP($J$5,'Цвет лючка'!A:B,2,0),\".\",VLOOKUP($K$5,'Цвет столешницы'!A:B,2,FALSE))","v":"EVL103/П/60*30/ANT/ANT.U003"},null,"1600*700*750",null,20793]
["EVL104/П/60*30/",{"$f":"CONCATENATE(A15,VLOOKUP($I$5,'Цвет мет. опор'!A:B,2,0),\"/\",VLOOKUP($J$5,'Цвет лючка'!A:B,2,0),\".\",VLOOKUP($K$5,'Цвет столешницы'!A:B,2,FALSE))","v":"EVL104/П/60*30/ANT/ANT.U003"},null,"1800*700*750",null,21261]
["EVL117/П/60*30/",{"$f":"CONCATENATE(A16,VLOOKUP($I$5,'Цвет мет. опор'!A:B,2,0),\"/\",VLOOKUP($J$5,'Цвет лючка'!A:B,2,0),\".\",VLOOKUP($K$5,'Цвет столешницы'!A:B,2,FALSE))","v":"EVL117/П/60*30/ANT/ANT.U003"},"Стол письменный на П образном м/к 60х30, глубиной 800 мм","1000*800*750",null,18783]
["EVL118/П/60*30/",{"$f":"CONCATENATE(A17,VLOOKUP($I$5,'Цвет мет. опор'!A:B,2,0),\"/\",VLOOKUP($J$5,'Цвет лючка'!A:B,2,0),\".\",VLOOKUP($K$5,'Цвет столешницы'!A:B,2,FALSE))","v":"EVL118/П/60*30/ANT/ANT.U003"},null,"1200*800*750",null,19737]
["EVL119/П/60*30/",{"$f":"CONCATENATE(A18,VLOOKUP($I$5,'Цвет мет. опор'!A:B,2,0),\"/\",VLOOKUP($J$5,'Цвет лючка'!A:B,2,0),\".\",VLOOKUP($K$5,'Цвет столешницы'!A:B,2,FALSE))","v":"EVL119/П/60*30/ANT/ANT.U003"},null,"1400*800*750",null,20845]
["EVL120/П/60*30/",{"$f":"CONCATENATE(A19,VLOOKUP($I$5,'Цвет мет. опор'!A:B,2,0),\"/\",VLOOKUP($J$5,'Цвет лючка'!A:B,2,0),\".\",VLOOKUP($K$5,'Цвет столешницы'!A:B,2,FALSE))","v":"EVL120/П/60*30/ANT/ANT.U003"},null,"1600*800*750",null,21492]
["EVL121/П/60*30/",{"$f":"CONCATENATE(A20,VLOOKUP($I$5,'Цвет мет. опор'!A:B,2,0),\"/\",VLOOKUP($J$5,'Цвет лючка'!A:B,2,0),\".\",VLOOKUP($K$5,'Цвет столешницы'!A:B,2,FALSE))","v":"EVL121/П/60*30/ANT/ANT.U003"},null,"1800*800*750",null,22364]
["EVL122/П/60*30/",{"$f":"CONCATENATE(A21,VLOOKUP($I$5,'Цвет мет. опор'!A:B,2,0),\"/\",VLOOKUP($J$5,'Цвет лючка'!A:B,2,0),\".\",VLOOKUP($K$5,'Цвет столешницы'!A:B,2,FALSE))","v":"EVL122/П/60*30/ANT/ANT.U003"},"Стол письменный на П образном м/к 60х30, глубиной 900 мм","1800*900*750",null,23881]
["EVL123SX/П/60*30/",{"$f":"CONCATENATE(A22,VLOOKUP($I$5,'Цвет мет. опор'!A:B,2,0),\"/\",VLOOKUP($J$5,'Цвет лючка'!A:B,2,0),\".\",VLOOKUP($K$5,'Цвет столешницы'!A:B,2,FALSE))","v":"EVL123SX/П/60*30/ANT/ANT.U003"},"Стол криволинейный левый/правый на П образном м/к 60х30, глубиной 600/900 мм","1200*900*750","правый",19578]
["EVL123DX/П/60*30/",{"$f":"CONCATENATE(A23,VLOOKUP($I$5,'Цвет мет. опор'!A:B,2,0),\"/\",VLOOKUP($J$5,'Цвет лючка'!A:B,2,0),\".\",VLOOKUP($K$5,'Цвет столешницы'!A:B,2,FALSE))","v":"EVL123DX/П/60*30/ANT/ANT.U003"}]
["EVL124SX/П/60*30/",{"$f":"CONCATENATE(A24,VLOOKUP($I$5,'Цвет мет. опор'!A:B,2,0),\"/\",VLOOKUP($J$5,'Цвет лючка'!A:B,2,0),\".\",VLOOKUP($K$5,'Цвет столешницы'!A:B,2,FALSE))","v":"EVL124SX/П/60*30/ANT/ANT.U003"},null,"1400*900*750",null,20427]
["EVL124DX/П/60*30/",{"$f":"CONCATENATE(A25,VLOOKUP($I$5,'Цвет мет. опор'!A:B,2,0),\"/\",VLOOKUP($J$5,'Цвет лючка'!A:B,2,0),\".\",VLOOKUP($K$5,'Цвет столешницы'!A:B,2,FALSE))","v":"EVL124DX/П/60*30/ANT/ANT.U003"}]
["EVL105SX/П/60*30/",{"$f":"CONCATENATE(A26,VLOOKUP($I$5,'Цвет мет. опор'!A:B,2,0),\"/\",VLOOKUP($J$5,'Цвет лючка'!A:B,2,0),\".\",VLOOKUP($K$5,'Цвет столешницы'!A:B,2,FALSE))","v":"EVL105SX/П/60*30/ANT/ANT.U003"},"Стол криволинейный левый/правый на П образном м/к 60х30, глубиной 700/900 мм","1200*900*750","правый",19036]
["EVL105DX/П/60*30/",{"$f":"CONCATENATE(A27,VLOOKUP($I$5,'Цвет мет. опор'!A:B,2,0),\"/\",VLOOKUP($J$5,'Цвет лючка'!A:B,2,0),\".\",VLOOKUP($K$5,'Цвет столешницы'!A:B,2,FALSE))","v":"EVL105DX/П/60*30/ANT/ANT.U003"}]
["EVL106SX/П/60*30/",{"$f":"CONCATENATE(A28,VLOOKUP($I$5,'Цвет мет. опор'!A:B,2,0),\"/\",VLOOKUP($J$5,'Цвет лючка'!A:B,2,0),\".\",VLOOKUP($K$5,'Цвет столешницы'!A:B,2,FALSE))","v":"EVL106SX/П/60*30/ANT/ANT.U003"},null,"1400*900*750",null,20086]
["EVL106DX/П/60*30/",{"$f":"CONCATENATE(A29,VLOOKUP($I$5,'Цвет мет. опор'!A:B,2,0),\"/\",VLOOKUP($J$5,'Цвет лючка'!A:B,2,0),\".\",VLOOKUP($K$5,'Цвет столешницы'!A:B,2,FALSE))","v":"EVL106DX/П/60*30/ANT/ANT.U003"}]
["EVL107SX/П/60*30/",{"$f":"CONCATENATE(A30,VLOOKUP($I$5,'Цвет мет. опор'!A:B,2,0),\"/\",VLOOKUP($J$5,'Цвет лючка'!A:B,2,0),\".\",VLOOKUP($K$5,'Цвет столешницы'!A:B,2,FALSE))","v":"EVL107SX/П/60*30/ANT/ANT.U003"},null,"1600*900*750",null,20778]
["EVL107DX/П/60*30/",{"$f":"CONCATENATE(A31,VLOOKUP($I$5,'Цвет мет. опор'!A:B,2,0),\"/\",VLOOKUP($J$5,'Цвет лючка'!A:B,2,0),\".\",VLOOKUP($K$5,'Цвет столешницы'!A:B,2,FALSE))","v":"EVL107DX/П/60*30/ANT/ANT.U003"}]
["EVL125SX/П/60*30/",{"$f":"CONCATENATE(A32,VLOOKUP($I$5,'Цвет мет. опор'!A:B,2,0),\"/\",VLOOKUP($J$5,'Цвет лючка'!A:B,2,0),\".\",VLOOKUP($K$5,'Цвет столешницы'!A:B,2,FALSE))","v":"EVL125SX/П/60*30/ANT/ANT.U003"},"Стол криволинейный левый/правый на П образном м/к 60х30, глубиной 800/900 мм","1400*900*750",null,21370]
["EVL125DX/П/60*30/",{"$f":"CONCATENATE(A33,VLOOKUP($I$5,'Цвет мет. опор'!A:B,2,0),\"/\",VLOOKUP($J$5,'Цвет лючка'!A:B,2,0),\".\",VLOOKUP($K$5,'Цвет столешницы'!A:B,2,FALSE))","v":"EVL125DX/П/60*30/ANT/ANT.U003"}]
["EVL126SX/П/60*30/",{"$f":"CONCATENATE(A34,VLOOKUP($I$5,'Цвет мет. опор'!A:B,2,0),\"/\",VLOOKUP($J$5,'Цвет лючка'!A:B,2,0),\".\",VLOOKUP($K$5,'Цвет столешницы'!A:B,2,FALSE))","v":"EVL126SX/П/60*30/ANT/ANT.U003"},null,"1600*900*750",null,21977]
["EVL126DX/П/60*30/",{"$f":"CONCATENATE(A35,VLOOKUP($I$5,'Цвет мет. опор'!A:B,2,0),\"/\",VLOOKUP($J$5,'Цвет лючка'!A:B,2,0),\".\",VLOOKUP($K$5,'Цвет столешницы'!A:B,2,FALSE))","v":"EVL126DX/П/60*30/ANT/ANT.U003"}]
["EVL109SX/П/60*30",{"$f":"CONCATENATE(A36,VLOOKUP($I$5,'Цвет мет. опор'!A:B,2,0),\"/\",VLOOKUP($J$5,'Цвет лючка'!A:B,2,0),\".\",VLOOKUP($K$5,'Цвет столешницы'!A:B,2,FALSE))","v":"EVL109SX/П/60*30ANT/ANT.U003"},"Стол эргономичный левый/правый на П образном м/к 60х30, глубиной 700/900 мм","1200х900\n/700х750",null,19013]
["EVL109DX/П/60*31",{"$f":"CONCATENATE(A37,VLOOKUP($I$5,'Цвет мет. опор'!A:B,2,0),\"/\",VLOOKUP($J$5,'Цвет лючка'!A:B,2,0),\".\",VLOOKUP($K$5,'Цвет столешницы'!A:B,2,FALSE))","v":"EVL109DX/П/60*31ANT/ANT.U003"}]
["EVL110SX/П/60*30",{"$f":"CONCATENATE(A38,VLOOKUP($I$5,'Цвет мет. опор'!A:B,2,0),\"/\",VLOOKUP($J$5,'Цвет лючка'!A:B,2,0),\".\",VLOOKUP($K$5,'Цвет столешницы'!A:B,2,FALSE))","v":"EVL110SX/П/60*30ANT/ANT.U003"},null,"1400х900\n/700х750",null,20109]
["EVL110DX/П/60*31",{"$f":"CONCATENATE(A39,VLOOKUP($I$5,'Цвет мет. опор'!A:B,2,0),\"/\",VLOOKUP($J$5,'Цвет лючка'!A:B,2,0),\".\",VLOOKUP($K$5,'Цвет столешницы'!A:B,2,FALSE))","v":"EVL110DX/П/60*31ANT/ANT.U003"}]
["EVL111SX/П/60*30",{"$f":"CONCATENATE(A40,VLOOKUP($I$5,'Цвет мет. опор'!A:B,2,0),\"/\",VLOOKUP($J$5,'Цвет лючка'!A:B,2,0),\".\",VLOOKUP($K$5,'Цвет столешницы'!A:B,2,FALSE))","v":"EVL111SX/П/60*30ANT/ANT.U003"},null,"1600х900\n/700х750",null,20753]
["EVL111DX/П/60*31",{"$f":"CONCATENATE(A41,VLOOKUP($I$5,'Цвет мет. опор'!A:B,2,0),\"/\",VLOOKUP($J$5,'Цвет лючка'!A:B,2,0),\".\",VLOOKUP($K$5,'Цвет столешницы'!A:B,2,FALSE))","v":"EVL111DX/П/60*31ANT/ANT.U003"}]
["EVL127SX/П/60*30/",{"$f":"CONCATENATE(A42,VLOOKUP($I$5,'Цвет мет. опор'!A:B,2,0),\"/\",VLOOKUP($J$5,'Цвет лючка'!A:B,2,0),\".\",VLOOKUP($K$5,'Цвет столешницы'!A:B,2,FALSE))","v":"EVL127SX/П/60*30/ANT/ANT.U003"},"Стол эргономичный левый/правый на П образном м/к 60х30, глубиной 600/1200 мм","1400*1200*750",null,30583]
["EVL127DX/П/60*30/",{"$f":"CONCATENATE(A43,VLOOKUP($I$5,'Цвет мет. опор'!A:B,2,0),\"/\",VLOOKUP($J$5,'Цвет лючка'!A:B,2,0),\".\",VLOOKUP($K$5,'Цвет столешницы'!A:B,2,FALSE))","v":"EVL127DX/П/60*30/ANT/ANT.U003"}]
["EVL128SX/П/60*30/",{"$f":"CONCATENATE(A44,VLOOKUP($I$5,'Цвет мет. опор'!A:B,2,0),\"/\",VLOOKUP($J$5,'Цвет лючка'!A:B,2,0),\".\",VLOOKUP($K$5,'Цвет столешницы'!A:B,2,FALSE))","v":"EVL128SX/П/60*30/ANT/ANT.U003"},null,"1600*1200*750",null,31393]
["EVL128DX/П/60*30/",{"$f":"CONCATENATE(A45,VLOOKUP($I$5,'Цвет мет. опор'!A:B,2,0),\"/\",VLOOKUP($J$5,'Цвет лючка'!A:B,2,0),\".\",VLOOKUP($K$5,'Цвет столешницы'!A:B,2,FALSE))","v":"EVL128DX/П/60*30/ANT/ANT.U003"}]
["EVL129SX/П/60*30/",{"$f":"CONCATENATE(A46,VLOOKUP($I$5,'Цвет мет. опор'!A:B,2,0),\"/\",VLOOKUP($J$5,'Цвет лючка'!A:B,2,0),\".\",VLOOKUP($K$5,'Цвет столешницы'!A:B,2,FALSE))","v":"EVL129SX/П/60*30/ANT/ANT.U003"},"Стол эргономичный левый/правый на П образном м/к 60х30, глубиной 700/1200 мм","1400*1200*750",null,31314]
["EVL129DX/П/60*30/",{"$f":"CONCATENATE(A47,VLOOKUP($I$5,'Цвет мет. опор'!A:B,2,0),\"/\",VLOOKUP($J$5,'Цвет лючка'!A:B,2,0),\".\",VLOOKUP($K$5,'Цвет столешницы'!A:B,2,FALSE))","v":"EVL129DX/П/60*30/ANT/ANT.U003"}]
["EVL130SX/П/60*30/",{"$f":"CONCATENATE(A48,VLOOKUP($I$5,'Цвет мет. опор'!A:B,2,0),\"/\",VLOOKUP($J$5,'Цвет лючка'!A:B,2,0),\".\",VLOOKUP($K$5,'Цвет столешницы'!A:B,2,FALSE))","v":"EVL130SX/П/60*30/ANT/ANT.U003"},null,"1600*1200*750",null,32388]
["EVL130DX/П/60*30/",{"$f":"CONCATENATE(A49,VLOOKUP($I$5,'Цвет мет. опор'!A:B,2,0),\"/\",VLOOKUP($J$5,'Цвет лючка'!A:B,2,0),\".\",VLOOKUP($K$5,'Цвет столешницы'!A:B,2,FALSE))","v":"EVL130DX/П/60*30/ANT/ANT.U003"}]
["EVL131SX/П/60*30/",{"$f":"CONCATENATE(A50,VLOOKUP($I$5,'Цвет мет. опор'!A:B,2,0),\"/\",VLOOKUP($J$5,'Цвет лючка'!A:B,2,0),\".\",VLOOKUP($K$5,'Цвет столешницы'!A:B,2,FALSE))","v":"EVL131SX/П/60*30/ANT/ANT.U003"},"Стол эргономичный левый/правый на П образном м/к 60х30, глубиной 800/1200 мм","1400*1200*750",null,31452]
["EVL131DX/П/60*30/",{"$f":"CONCATENATE(A51,VLOOKUP($I$5,'Цвет мет. опор'!A:B,2,0),\"/\",VLOOKUP($J$5,'Цвет лючка'!A:B,2,0),\".\",VLOOKUP($K$5,'Цвет столешницы'!A:B,2,FALSE))","v":"EVL131DX/П/60*30/ANT/ANT.U003"}]
["EVL132SX/П/60*30/",{"$f":"CONCATENATE(A52,VLOOKUP($I$5,'Цвет мет. опор'!A:B,2,0),\"/\",VLOOKUP($J$5,'Цвет лючка'!A:B,2,0),\".\",VLOOKUP($K$5,'Цвет столешницы'!A:B,2,FALSE))","v":"EVL132SX/П/60*30/ANT/ANT.U003"},null,"1600*1200*750",null,32179]
["EVL132DX/П/60*30/",{"$f":"CONCATENATE(A53,VLOOKUP($I$5,'Цвет мет. опор'!A:B,2,0),\"/\",VLOOKUP($J$5,'Цвет лючка'!A:B,2,0),\".\",VLOOKUP($K$5,'Цвет столешницы'!A:B,2,FALSE))","v":"EVL132DX/П/60*30/ANT/ANT.U003"}]
["EVL601/П/60*30/",{"$f":"CONCATENATE(A54,VLOOKUP($I$5,'Цвет мет. опор'!A:B,2,0),\"/\",VLOOKUP($J$5,'Цвет лючка'!A:B,2,0),\".\",VLOOKUP($K$5,'Цвет столешницы'!A:B,2,FALSE))","v":"EVL601/П/60*30/ANT/ANT.U003"},"Рабочая станция на П образном м/к 60х30, глубиной 1236 мм","1200*1236*750",null,31304]
["EVL602/П/60*30/",{"$f":"CONCATENATE(A55,VLOOKUP($I$5,'Цвет мет. опор'!A:B,2,0),\"/\",VLOOKUP($J$5,'Цвет лючка'!A:B,2,0),\".\",VLOOKUP($K$5,'Цвет столешницы'!A:B,2,FALSE))","v":"EVL602/П/60*30/ANT/ANT.U003"},null,"1400*1236*750",null,32199]
["EVL603/П/60*30/",{"$f":"CONCATENATE(A56,VLOOKUP($I$5,'Цвет мет. опор'!A:B,2,0),\"/\",VLOOKUP($J$5,'Цвет лючка'!A:B,2,0),\".\",VLOOKUP($K$5,'Цвет столешницы'!A:B,2,FALSE))","v":"EVL603/П/60*30/ANT/ANT.U003"},null,"1600*1236*750",null,34363]
["EVL681/П/60*30/",{"$f":"CONCATENATE(A57,VLOOKUP($I$5,'Цвет мет. опор'!A:B,2,0),\"/\",VLOOKUP($J$5,'Цвет лючка'!A:B,2,0),\".\",VLOOKUP($K$5,'Цвет столешницы'!A:B,2,FALSE))","v":"EVL681/П/60*30/ANT/ANT.U003"},null,"1800*1236*751",null,37030]
["EVL604/П/60*30/",{"$f":"CONCATENATE(A58,VLOOKUP($I$5,'Цвет мет. опор'!A:B,2,0),\"/\",VLOOKUP($J$5,'Цвет лючка'!A:B,2,0),\".\",VLOOKUP($K$5,'Цвет столешницы'!A:B,2,FALSE))","v":"EVL604/П/60*30/ANT/ANT.U003"},"Рабочая станция на П образном м/к 60х30 глубиной 1436 мм","1200*1436*750",null,28582]
["EVL605/П/60*30/",{"$f":"CONCATENATE(A59,VLOOKUP($I$5,'Цвет мет. опор'!A:B,2,0),\"/\",VLOOKUP($J$5,'Цвет лючка'!A:B,2,0),\".\",VLOOKUP($K$5,'Цвет столешницы'!A:B,2,FALSE))","v":"EVL605/П/60*30/ANT/ANT.U003"},null,"1400*1436*750",null,34592]
["EVL606/П/60*30/",{"$f":"CONCATENATE(A60,VLOOKUP($I$5,'Цвет мет. опор'!A:B,2,0),\"/\",VLOOKUP($J$5,'Цвет лючка'!A:B,2,0),\".\",VLOOKUP($K$5,'Цвет столешницы'!A:B,2,FALSE))","v":"EVL606/П/60*30/ANT/ANT.U003"},null,"1600*1436*750",null,35839]
["EVL682/П/60*30/",{"$f":"CONCATENATE(A61,VLOOKUP($I$5,'Цвет мет. опор'!A:B,2,0),\"/\",VLOOKUP($J$5,'Цвет лючка'!A:B,2,0),\".\",VLOOKUP($K$5,'Цвет столешницы'!A:B,2,FALSE))","v":"EVL682/П/60*30/ANT/ANT.U003"},null,"1800*1436*751",null,38842]
["EVL607/П/60*30/",{"$f":"CONCATENATE(A62,VLOOKUP($I$5,'Цвет мет. опор'!A:B,2,0),\"/\",VLOOKUP($J$5,'Цвет лючка'!A:B,2,0),\".\",VLOOKUP($K$5,'Цвет столешницы'!A:B,2,FALSE))","v":"EVL607/П/60*30/ANT/ANT.U003"},"Рабочая станция на П образном м/к 60х30 глубиной 1636 мм","1200*1636*750",null,34242]
["EVL608/П/60*30/",{"$f":"CONCATENATE(A63,VLOOKUP($I$5,'Цвет мет. опор'!A:B,2,0),\"/\",VLOOKUP($J$5,'Цвет лючка'!A:B,2,0),\".\",VLOOKUP($K$5,'Цвет столешницы'!A:B,2,FALSE))","v":"EVL608/П/60*30/ANT/ANT.U003"},null,"1400*1636*750",null,35933]
["EVL609/П/60*30/",{"$f":"CONCATENATE(A64,VLOOKUP($I$5,'Цвет мет. опор'!A:B,2,0),\"/\",VLOOKUP($J$5,'Цвет лючка'!A:B,2,0),\".\",VLOOKUP($K$5,'Цвет столешницы'!A:B,2,FALSE))","v":"EVL609/П/60*30/ANT/ANT.U003"},null,"1600*1636*750",null,37332]
["EVL683/П/60*30/",{"$f":"CONCATENATE(A65,VLOOKUP($I$5,'Цвет мет. опор'!A:B,2,0),\"/\",VLOOKUP($J$5,'Цвет лючка'!A:B,2,0),\".\",VLOOKUP($K$5,'Цвет столешницы'!A:B,2,FALSE))","v":"EVL683/П/60*30/ANT/ANT.U003"},null,"1800*1636*751",null,43511]
["EVL610/П/60*30/",{"$f":"CONCATENATE(A66,VLOOKUP($I$5,'Цвет мет. опор'!A:B,2,0),\"/\",VLOOKUP($J$5,'Цвет лючка'!A:B,2,0),\".\",VLOOKUP($K$5,'Цвет столешницы'!A:B,2,FALSE))","v":"EVL610/П/60*30/ANT/ANT.U003"},"Рабочая станция криволинейная на П образном м/к 60х30 глубиной 1236/1836","1200*1836*750",null,34158]
["EVL611/П/60*30/",{"$f":"CONCATENATE(A67,VLOOKUP($I$5,'Цвет мет. опор'!A:B,2,0),\"/\",VLOOKUP($J$5,'Цвет лючка'!A:B,2,0),\".\",VLOOKUP($K$5,'Цвет столешницы'!A:B,2,FALSE))","v":"EVL611/П/60*30/ANT/ANT.U003"},null,"1400*1836*750",null,34723]
["EVL612/П/60*30/",{"$f":"CONCATENATE(A68,VLOOKUP($I$5,'Цвет мет. опор'!A:B,2,0),\"/\",VLOOKUP($J$5,'Цвет лючка'!A:B,2,0),\".\",VLOOKUP($K$5,'Цвет столешницы'!A:B,2,FALSE))","v":"EVL612/П/60*30/ANT/ANT.U003"},null,"1600*1836*750",null,36363]
["EVL613/П/60*30/",{"$f":"CONCATENATE(A69,VLOOKUP($I$5,'Цвет мет. опор'!A:B,2,0),\"/\",VLOOKUP($J$5,'Цвет лючка'!A:B,2,0),\".\",VLOOKUP($K$5,'Цвет столешницы'!A:B,2,FALSE))","v":"EVL613/П/60*30/ANT/ANT.U003"},"Рабочая станция криволинейная на \nП-образном м/к 60х30 глубиной 1436/1836","1200*1836*750",null,33733]
["EVL614/П/60*30/",{"$f":"CONCATENATE(A70,VLOOKUP($I$5,'Цвет мет. опор'!A:B,2,0),\"/\",VLOOKUP($J$5,'Цвет лючка'!A:B,2,0),\".\",VLOOKUP($K$5,'Цвет столешницы'!A:B,2,FALSE))","v":"EVL614/П/60*30/ANT/ANT.U003"},null,"1400*1836*750",null,34885]
["EVL615/П/60*30/",{"$f":"CONCATENATE(A71,VLOOKUP($I$5,'Цвет мет. опор'!A:B,2,0),\"/\",VLOOKUP($J$5,'Цвет лючка'!A:B,2,0),\".\",VLOOKUP($K$5,'Цвет столешницы'!A:B,2,FALSE))","v":"EVL615/П/60*30/ANT/ANT.U003"},null,"1600*1836*750",null,36262]
["EVL616/П/60*30/",{"$f":"CONCATENATE(A72,VLOOKUP($I$5,'Цвет мет. опор'!A:B,2,0),\"/\",VLOOKUP($J$5,'Цвет лючка'!A:B,2,0),\".\",VLOOKUP($K$5,'Цвет столешницы'!A:B,2,FALSE))","v":"EVL616/П/60*30/ANT/ANT.U003"},"Рабочая станция эргономичная на \nП-образном м/к 60х30 глубиной 1236/2436","1400*2436*750",null,56342]
["EVL617/П/60*30/",{"$f":"CONCATENATE(A73,VLOOKUP($I$5,'Цвет мет. опор'!A:B,2,0),\"/\",VLOOKUP($J$5,'Цвет лючка'!A:B,2,0),\".\",VLOOKUP($K$5,'Цвет столешницы'!A:B,2,FALSE))","v":"EVL617/П/60*30/ANT/ANT.U003"},null,"1600*2436*750",null,57961]
["EVL618/П/60*30/",{"$f":"CONCATENATE(A74,VLOOKUP($I$5,'Цвет мет. опор'!A:B,2,0),\"/\",VLOOKUP($J$5,'Цвет лючка'!A:B,2,0),\".\",VLOOKUP($K$5,'Цвет столешницы'!A:B,2,FALSE))","v":"EVL618/П/60*30/ANT/ANT.U003"},"Рабочая станция эргономичная на \nП-образном м/к 60х30 глубиной 1436/2436","1400*2440*750",null,57429]
["EVL619/П/60*30/",{"$f":"CONCATENATE(A75,VLOOKUP($I$5,'Цвет мет. опор'!A:B,2,0),\"/\",VLOOKUP($J$5,'Цвет лючка'!A:B,2,0),\".\",VLOOKUP($K$5,'Цвет столешницы'!A:B,2,FALSE))","v":"EVL619/П/60*30/ANT/ANT.U003"},null,"1600*2440*750",null,58903]
["EVL620/П/60*30/",{"$f":"CONCATENATE(A76,VLOOKUP($I$5,'Цвет мет. опор'!A:B,2,0),\"/\",VLOOKUP($J$5,'Цвет лючка'!A:B,2,0),\".\",VLOOKUP($K$5,'Цвет столешницы'!A:B,2,FALSE))","v":"EVL620/П/60*30/ANT/ANT.U003"},"Рабочая станция эргономичная на \nП-образном м/к 60х30 глубиной 1636/2436","1400*2440*750",null,57640]
["EVL621/П/60*30/",{"$f":"CONCATENATE(A77,VLOOKUP($I$5,'Цвет мет. опор'!A:B,2,0),\"/\",VLOOKUP($J$5,'Цвет лючка'!A:B,2,0),\".\",VLOOKUP($K$5,'Цвет столешницы'!A:B,2,FALSE))","v":"EVL621/П/60*30/ANT/ANT.U003"},null,"1600*2440*750",null,59094]
["EVL622/П/60*30/",{"$f":"CONCATENATE(A78,VLOOKUP($I$5,'Цвет мет. опор'!A:B,2,0),\"/\",VLOOKUP($J$5,'Цвет лючка'!A:B,2,0),\".\",VLOOKUP($K$5,'Цвет столешницы'!A:B,2,FALSE))","v":"EVL622/П/60*30/ANT/ANT.U003"},"Рабочая станция эргономичная на \nП-образном м/к 60х30 \nглубиной 600/900","2400*900*750",null,37222]
["EVL623/П/60*30/",{"$f":"CONCATENATE(A79,VLOOKUP($I$5,'Цвет мет. опор'!A:B,2,0),\"/\",VLOOKUP($J$5,'Цвет лючка'!A:B,2,0),\".\",VLOOKUP($K$5,'Цвет столешницы'!A:B,2,FALSE))","v":"EVL623/П/60*30/ANT/ANT.U003"},null,"2800*900*750",null,39285]
["EVL624/П/60*30/",{"$f":"CONCATENATE(A80,VLOOKUP($I$5,'Цвет мет. опор'!A:B,2,0),\"/\",VLOOKUP($J$5,'Цвет лючка'!A:B,2,0),\".\",VLOOKUP($K$5,'Цвет столешницы'!A:B,2,FALSE))","v":"EVL624/П/60*30/ANT/ANT.U003"},null,"3200*900*750",null,40526]
["EVL625/П/60*30/",{"$f":"CONCATENATE(A81,VLOOKUP($I$5,'Цвет мет. опор'!A:B,2,0),\"/\",VLOOKUP($J$5,'Цвет лючка'!A:B,2,0),\".\",VLOOKUP($K$5,'Цвет столешницы'!A:B,2,FALSE))","v":"EVL625/П/60*30/ANT/ANT.U003"},"Рабочая станция эргономичная на \nП-образном м/к 60х30 \nглубиной 700/900","2400*900*750",null,36456]
["EVL626/П/60*30/",{"$f":"CONCATENATE(A82,VLOOKUP($I$5,'Цвет мет. опор'!A:B,2,0),\"/\",VLOOKUP($J$5,'Цвет лючка'!A:B,2,0),\".\",VLOOKUP($K$5,'Цвет столешницы'!A:B,2,FALSE))","v":"EVL626/П/60*30/ANT/ANT.U003"},null,"2800*900*750",null,38377]
["EVL627/П/60*30/",{"$f":"CONCATENATE(A83,VLOOKUP($I$5,'Цвет мет. опор'!A:B,2,0),\"/\",VLOOKUP($J$5,'Цвет лючка'!A:B,2,0),\".\",VLOOKUP($K$5,'Цвет столешницы'!A:B,2,FALSE))","v":"EVL627/П/60*30/ANT/ANT.U003"},null,"3200*900*750",null,40005]
["EVL628/П/60*30/",{"$f":"CONCATENATE(A84,VLOOKUP($I$5,'Цвет мет. опор'!A:B,2,0),\"/\",VLOOKUP($J$5,'Цвет лючка'!A:B,2,0),\".\",VLOOKUP($K$5,'Цвет столешницы'!A:B,2,FALSE))","v":"EVL628/П/60*30/ANT/ANT.U003"},"Рабочая станция эргономичная на \nП-образном м/к 60х30 \nглубиной 800/900","2400*900*750",null,38049]
["EVL629/П/60*30/",{"$f":"CONCATENATE(A85,VLOOKUP($I$5,'Цвет мет. опор'!A:B,2,0),\"/\",VLOOKUP($J$5,'Цвет лючка'!A:B,2,0),\".\",VLOOKUP($K$5,'Цвет столешницы'!A:B,2,FALSE))","v":"EVL629/П/60*30/ANT/ANT.U003"},null,"2800*900*750",null,40066]
["EVL630/П/60*30/",{"$f":"CONCATENATE(A86,VLOOKUP($I$5,'Цвет мет. опор'!A:B,2,0),\"/\",VLOOKUP($J$5,'Цвет лючка'!A:B,2,0),\".\",VLOOKUP($K$5,'Цвет столешницы'!A:B,2,FALSE))","v":"EVL630/П/60*30/ANT/ANT.U003"},null,"3200*900*750",null,41280]
["EVL631/П/60*30/",{"$f":"CONCATENATE(A87,VLOOKUP($I$5,'Цвет мет. опор'!A:B,2,0),\"/\",VLOOKUP($J$5,'Цвет лючка'!A:B,2,0),\".\",VLOOKUP($K$5,'Цвет столешницы'!A:B,2,FALSE))","v":"EVL631/П/60*30/ANT/ANT.U003"},"Рабочая станция эргономичная на \nП-образном м/к 60х30 \nглубиной 600/1200","2400*1200*750",null,41944]
["EVL632/П/60*30/",{"$f":"CONCATENATE(A88,VLOOKUP($I$5,'Цвет мет. опор'!A:B,2,0),\"/\",VLOOKUP($J$5,'Цвет лючка'!A:B,2,0),\".\",VLOOKUP($K$5,'Цвет столешницы'!A:B,2,FALSE))","v":"EVL632/П/60*30/ANT/ANT.U003"},null,"2800*1200*750",null,44107]
["EVL633/П/60*30/",{"$f":"CONCATENATE(A89,VLOOKUP($I$5,'Цвет мет. опор'!A:B,2,0),\"/\",VLOOKUP($J$5,'Цвет лючка'!A:B,2,0),\".\",VLOOKUP($K$5,'Цвет столешницы'!A:B,2,FALSE))","v":"EVL633/П/60*30/ANT/ANT.U003"},null,"3200*1200*750",null,45726]
["EVL634/П/60*30/",{"$f":"CONCATENATE(A90,VLOOKUP($I$5,'Цвет мет. опор'!A:B,2,0),\"/\",VLOOKUP($J$5,'Цвет лючка'!A:B,2,0),\".\",VLOOKUP($K$5,'Цвет столешницы'!A:B,2,FALSE))","v":"EVL634/П/60*30/ANT/ANT.U003"},"Рабочая станция эргономичная на \nП-образном м/к 60х30 \nглубиной 700/1200","2400*1200*750",null,42332]
["EVL635/П/60*30/",{"$f":"CONCATENATE(A91,VLOOKUP($I$5,'Цвет мет. опор'!A:B,2,0),\"/\",VLOOKUP($J$5,'Цвет лючка'!A:B,2,0),\".\",VLOOKUP($K$5,'Цвет столешницы'!A:B,2,FALSE))","v":"EVL635/П/60*30/ANT/ANT.U003"},null,"2800*1200*750",null,44803]
["EVL636/П/60*30/",{"$f":"CONCATENATE(A92,VLOOKUP($I$5,'Цвет мет. опор'!A:B,2,0),\"/\",VLOOKUP($J$5,'Цвет лючка'!A:B,2,0),\".\",VLOOKUP($K$5,'Цвет столешницы'!A:B,2,FALSE))","v":"EVL636/П/60*30/ANT/ANT.U003"},null,"3200*1200*750",null,46477]
["EVL637/П/60*30/",{"$f":"CONCATENATE(A93,VLOOKUP($I$5,'Цвет мет. опор'!A:B,2,0),\"/\",VLOOKUP($J$5,'Цвет лючка'!A:B,2,0),\".\",VLOOKUP($K$5,'Цвет столешницы'!A:B,2,FALSE))","v":"EVL637/П/60*30/ANT/ANT.U003"},"Рабочая станция эргономичная на \nП-образном м/к 60х30 \nглубиной 800/1200","2400*1200*750",null,42703]
["EVL638/П/60*30/",{"$f":"CONCATENATE(A94,VLOOKUP($I$5,'Цвет мет. опор'!A:B,2,0),\"/\",VLOOKUP($J$5,'Цвет лючка'!A:B,2,0),\".\",VLOOKUP($K$5,'Цвет столешницы'!A:B,2,FALSE))","v":"EVL638/П/60*30/ANT/ANT.U003"},null,"2800*1200*750",null,45306]
["EVL639/П/60*30/",{"$f":"CONCATENATE(A95,VLOOKUP($I$5,'Цвет мет. опор'!A:B,2,0),\"/\",VLOOKUP($J$5,'Цвет лючка'!A:B,2,0),\".\",VLOOKUP($K$5,'Цвет столешницы'!A:B,2,FALSE))","v":"EVL639/П/60*30/ANT/ANT.U003"},null,"3200*1200*750",null,46760]
["EVL180/П/60*30/",{"$f":"CONCATENATE(A96,VLOOKUP($I$5,'Цвет мет. опор'!A:B,2,0),\"/\",VLOOKUP($J$5,'Цвет лючка'!A:B,2,0),\".\",VLOOKUP($K$5,'Цвет столешницы'!A:B,2,FALSE))","v":"EVL180/П/60*30/ANT/ANT.U003"},"Приставка к столу рабочая 1000х500 (используется в качестве брифинга или боковой приставки)","1000x500x750",null,12604]
["EVL135/П/60*30/",{"$f":"CONCATENATE(A97,VLOOKUP($I$5,'Цвет мет. опор'!A:B,2,0),\"/\",VLOOKUP($J$5,'Цвет лючка'!A:B,2,0),\".\",VLOOKUP($K$5,'Цвет столешницы'!A:B,2,FALSE))","v":"EVL135/П/60*30/ANT/ANT.U003"},"Приставной элемент на \nП-образном м/к 60х30 \nглубиной 700 (используется только  в качестве брифинга)","1000*600*750",null,13346]
["EVL137/П/60*30/",{"$f":"CONCATENATE(A98,VLOOKUP($I$5,'Цвет мет. опор'!A:B,2,0),\"/\",VLOOKUP($J$5,'Цвет лючка'!A:B,2,0),\".\",VLOOKUP($K$5,'Цвет столешницы'!A:B,2,FALSE))","v":"EVL137/П/60*30/ANT/ANT.U003"},null,"1200*700*750",null,14499]
["EVL701/П/60*30/",{"$f":"CONCATENATE(A99,VLOOKUP($I$5,'Цвет мет. опор'!A:B,2,0),\"/\",VLOOKUP($J$5,'Цвет лючка'!A:B,2,0),\".\",VLOOKUP($K$5,'Цвет столешницы'!A:B,2,FALSE))","v":"EVL701/П/60*30/ANT/ANT.U003"},"Рабочая станция на П образном м/к 60х30 с тумбой \n(композиция стол+тумба)","1450*700*750","Тумба 450х700х750",33487]
["EVL702/П/60*30/",{"$f":"CONCATENATE(A100,VLOOKUP($I$5,'Цвет мет. опор'!A:B,2,0),\"/\",VLOOKUP($J$5,'Цвет лючка'!A:B,2,0),\".\",VLOOKUP($K$5,'Цвет столешницы'!A:B,2,FALSE))","v":"EVL702/П/60*30/ANT/ANT.U003"},null,"1650*700*750",null,34439]
["EVL703/П/60*30/",{"$f":"CONCATENATE(A101,VLOOKUP($I$5,'Цвет мет. опор'!A:B,2,0),\"/\",VLOOKUP($J$5,'Цвет лючка'!A:B,2,0),\".\",VLOOKUP($K$5,'Цвет столешницы'!A:B,2,FALSE))","v":"EVL703/П/60*30/ANT/ANT.U003"},null,"1850*700*750",null,35290]
["EVL704/П/60*30/",{"$f":"CONCATENATE(A102,VLOOKUP($I$5,'Цвет мет. опор'!A:B,2,0),\"/\",VLOOKUP($J$5,'Цвет лючка'!A:B,2,0),\".\",VLOOKUP($K$5,'Цвет столешницы'!A:B,2,FALSE))","v":"EVL704/П/60*30/ANT/ANT.U003"},null,"2050*700*750",null,36012]
["EVL705/П/60*30/",{"$f":"CONCATENATE(A103,VLOOKUP($I$5,'Цвет мет. опор'!A:B,2,0),\"/\",VLOOKUP($J$5,'Цвет лючка'!A:B,2,0),\".\",VLOOKUP($K$5,'Цвет столешницы'!A:B,2,FALSE))","v":"EVL705/П/60*30/ANT/ANT.U003"},null,"2250*700*750",null,36479]
["EVL706/П/60*30/",{"$f":"CONCATENATE(A104,VLOOKUP($I$5,'Цвет мет. опор'!A:B,2,0),\"/\",VLOOKUP($J$5,'Цвет лючка'!A:B,2,0),\".\",VLOOKUP($K$5,'Цвет столешницы'!A:B,2,FALSE))","v":"EVL706/П/60*30/ANT/ANT.U003"},"Рабочая станция на П образном м/к 60х30 с тумбой \n(композиция двойной бенч+тумба)","1450*1436*750","Тумба  450х1436х750",57951]
["EVL707/П/60*30/",{"$f":"CONCATENATE(A105,VLOOKUP($I$5,'Цвет мет. опор'!A:B,2,0),\"/\",VLOOKUP($J$5,'Цвет лючка'!A:B,2,0),\".\",VLOOKUP($K$5,'Цвет столешницы'!A:B,2,FALSE))","v":"EVL707/П/60*30/ANT/ANT.U003"},null,"1650*1436*750",null,59676]
["EVL708/П/60*30/",{"$f":"CONCATENATE(A106,VLOOKUP($I$5,'Цвет мет. опор'!A:B,2,0),\"/\",VLOOKUP($J$5,'Цвет лючка'!A:B,2,0),\".\",VLOOKUP($K$5,'Цвет столешницы'!A:B,2,FALSE))","v":"EVL708/П/60*30/ANT/ANT.U003"},null,"1850*1436*750",null,61374]
["EVL709/П/60*30/",{"$f":"CONCATENATE(A107,VLOOKUP($I$5,'Цвет мет. опор'!A:B,2,0),\"/\",VLOOKUP($J$5,'Цвет лючка'!A:B,2,0),\".\",VLOOKUP($K$5,'Цвет столешницы'!A:B,2,FALSE))","v":"EVL709/П/60*30/ANT/ANT.U003"},null,"2050*1436*750",null,62477]
["EVL710/П/60*30/",{"$f":"CONCATENATE(A108,VLOOKUP($I$5,'Цвет мет. опор'!A:B,2,0),\"/\",VLOOKUP($J$5,'Цвет лючка'!A:B,2,0),\".\",VLOOKUP($K$5,'Цвет столешницы'!A:B,2,FALSE))","v":"EVL710/П/60*30/ANT/ANT.U003"},null,"2250*1436*750",null,63970]
["EVL711/П/60*30/",{"$f":"CONCATENATE(A109,VLOOKUP($I$5,'Цвет мет. опор'!A:B,2,0),\"/\",VLOOKUP($J$5,'Цвет лючка'!A:B,2,0),\".\",VLOOKUP($K$5,'Цвет столешницы'!A:B,2,FALSE))","v":"EVL711/П/60*30/ANT/ANT.U003"},"Рабочая станция на П образном м/к 60х30 со шкафом-купе\n(композиция двойной бенч+шкаф-купе)","1410*1436*750","Шкаф-купе приставной 1440х410х750",51855]
["EVL712/П/60*30/",{"$f":"CONCATENATE(A110,VLOOKUP($I$5,'Цвет мет. опор'!A:B,2,0),\"/\",VLOOKUP($J$5,'Цвет лючка'!A:B,2,0),\".\",VLOOKUP($K$5,'Цвет столешницы'!A:B,2,FALSE))","v":"EVL712/П/60*30/ANT/ANT.U003"},null,"1610*1436*750",null,49047]
["EVL713/П/60*30/",{"$f":"CONCATENATE(A111,VLOOKUP($I$5,'Цвет мет. опор'!A:B,2,0),\"/\",VLOOKUP($J$5,'Цвет лючка'!A:B,2,0),\".\",VLOOKUP($K$5,'Цвет столешницы'!A:B,2,FALSE))","v":"EVL713/П/60*30/ANT/ANT.U003"},null,"1810*1436*750",null,55056]
["EVL714/П/60*30/",{"$f":"CONCATENATE(A112,VLOOKUP($I$5,'Цвет мет. опор'!A:B,2,0),\"/\",VLOOKUP($J$5,'Цвет лючка'!A:B,2,0),\".\",VLOOKUP($K$5,'Цвет столешницы'!A:B,2,FALSE))","v":"EVL714/П/60*30/ANT/ANT.U003"},null,"2010*1436*750",null,56304]
["EVL715/П/60*30/",{"$f":"CONCATENATE(A113,VLOOKUP($I$5,'Цвет мет. опор'!A:B,2,0),\"/\",VLOOKUP($J$5,'Цвет лючка'!A:B,2,0),\".\",VLOOKUP($K$5,'Цвет столешницы'!A:B,2,FALSE))","v":"EVL715/П/60*30/ANT/ANT.U003"},null,"2210*1436*750",null,57874]
["EVL716/П/60*30/",{"$f":"CONCATENATE(A114,VLOOKUP($I$5,'Цвет мет. опор'!A:B,2,0),\"/\",VLOOKUP($J$5,'Цвет лючка'!A:B,2,0),\".\",VLOOKUP($K$5,'Цвет столешницы'!A:B,2,FALSE))","v":"EVL716/П/60*30/ANT/ANT.U003"},"Рабочая станция на П образном м/к 60х30 со шкафом-купе\n(композиция двойной бенч+шкаф-купе)","1410*1436*1098","Шкаф-купе приставной 1440х410х1098",56717]
["EVL717/П/60*30/",{"$f":"CONCATENATE(A115,VLOOKUP($I$5,'Цвет мет. опор'!A:B,2,0),\"/\",VLOOKUP($J$5,'Цвет лючка'!A:B,2,0),\".\",VLOOKUP($K$5,'Цвет столешницы'!A:B,2,FALSE))","v":"EVL717/П/60*30/ANT/ANT.U003"},null,"1610*1436*1098",null,53909]
["EVL718/П/60*30/",{"$f":"CONCATENATE(A116,VLOOKUP($I$5,'Цвет мет. опор'!A:B,2,0),\"/\",VLOOKUP($J$5,'Цвет лючка'!A:B,2,0),\".\",VLOOKUP($K$5,'Цвет столешницы'!A:B,2,FALSE))","v":"EVL718/П/60*30/ANT/ANT.U003"},null,"1810*1436*1098",null,59918]
["EVL719/П/60*30/",{"$f":"CONCATENATE(A117,VLOOKUP($I$5,'Цвет мет. опор'!A:B,2,0),\"/\",VLOOKUP($J$5,'Цвет лючка'!A:B,2,0),\".\",VLOOKUP($K$5,'Цвет столешницы'!A:B,2,FALSE))","v":"EVL719/П/60*30/ANT/ANT.U003"},null,"2010*1436*1098",null,61166]
["EVL720/П/60*30/",{"$f":"CONCATENATE(A118,VLOOKUP($I$5,'Цвет мет. опор'!A:B,2,0),\"/\",VLOOKUP($J$5,'Цвет лючка'!A:B,2,0),\".\",VLOOKUP($K$5,'Цвет столешницы'!A:B,2,FALSE))","v":"EVL720/П/60*30/ANT/ANT.U003"},null,"2210*1436*1098",null,62736]
["EVL721/П/60*30/",{"$f":"CONCATENATE(A119,VLOOKUP($I$5,'Цвет мет. опор'!A:B,2,0),\"/\",VLOOKUP($J$5,'Цвет лючка'!A:B,2,0),\".\",VLOOKUP($K$5,'Цвет столешницы'!A:B,2,FALSE))","v":"EVL721/П/60*30/ANT/ANT.U003"},"Стол письменный на П образном м/к 60х30 со шкафом-купе\n(композиция двойной бенч+шкаф-купе)","1410*1240*1098","Шкаф-купе приставной  1240х410х1098",41218]
["EVL722/П/60*30/",{"$f":"CONCATENATE(A120,VLOOKUP($I$5,'Цвет мет. опор'!A:B,2,0),\"/\",VLOOKUP($J$5,'Цвет лючка'!A:B,2,0),\".\",VLOOKUP($K$5,'Цвет столешницы'!A:B,2,FALSE))","v":"EVL722/П/60*30/ANT/ANT.U003"},null,"1610*1240*1098",null,42170]
["EVL723/П/60*30/",{"$f":"CONCATENATE(A121,VLOOKUP($I$5,'Цвет мет. опор'!A:B,2,0),\"/\",VLOOKUP($J$5,'Цвет лючка'!A:B,2,0),\".\",VLOOKUP($K$5,'Цвет столешницы'!A:B,2,FALSE))","v":"EVL723/П/60*30/ANT/ANT.U003"},null,"1810*1240*1098",null,43021]
["EVL724/П/60*30/",{"$f":"CONCATENATE(A122,VLOOKUP($I$5,'Цвет мет. опор'!A:B,2,0),\"/\",VLOOKUP($J$5,'Цвет лючка'!A:B,2,0),\".\",VLOOKUP($K$5,'Цвет столешницы'!A:B,2,FALSE))","v":"EVL724/П/60*30/ANT/ANT.U003"},null,"2010*1240*1098",null,43743]
["EVL725/П/60*30/",{"$f":"CONCATENATE(A123,VLOOKUP($I$5,'Цвет мет. опор'!A:B,2,0),\"/\",VLOOKUP($J$5,'Цвет лючка'!A:B,2,0),\".\",VLOOKUP($K$5,'Цвет столешницы'!A:B,2,FALSE))","v":"EVL725/П/60*30/ANT/ANT.U003"},null,"2210*1240*1098",null,44210]
["EVL726/П/60*30/",{"$f":"CONCATENATE(A124,VLOOKUP($I$5,'Цвет мет. опор'!A:B,2,0),\"/\",VLOOKUP($J$5,'Цвет лючка'!A:B,2,0),\".\",VLOOKUP($K$5,'Цвет столешницы'!A:B,2,FALSE))","v":"EVL726/П/60*30/ANT/ANT.U003"},"Рабочая станция на П образном м/к 60х30 со шкафом-купе\n(композиция двойной бенч+шкаф-купе)","1410*2332*1098","Шкаф-купе приставной \n2332х410х1098",80363]
["EVL727/П/60*30/",{"$f":"CONCATENATE(A125,VLOOKUP($I$5,'Цвет мет. опор'!A:B,2,0),\"/\",VLOOKUP($J$5,'Цвет лючка'!A:B,2,0),\".\",VLOOKUP($K$5,'Цвет столешницы'!A:B,2,FALSE))","v":"EVL727/П/60*30/ANT/ANT.U003"},null,"1610*2332*1098",null,77556]
["EVL728/П/60*30/",{"$f":"CONCATENATE(A126,VLOOKUP($I$5,'Цвет мет. опор'!A:B,2,0),\"/\",VLOOKUP($J$5,'Цвет лючка'!A:B,2,0),\".\",VLOOKUP($K$5,'Цвет столешницы'!A:B,2,FALSE))","v":"EVL728/П/60*30/ANT/ANT.U003"},null,"1810*2332*1098",null,83565]
["EVL729/П/60*30/",{"$f":"CONCATENATE(A127,VLOOKUP($I$5,'Цвет мет. опор'!A:B,2,0),\"/\",VLOOKUP($J$5,'Цвет лючка'!A:B,2,0),\".\",VLOOKUP($K$5,'Цвет столешницы'!A:B,2,FALSE))","v":"EVL729/П/60*30/ANT/ANT.U003"},null,"2010*2332*1098",null,84812]
["EVL730/П/60*30/",{"$f":"CONCATENATE(A128,VLOOKUP($I$5,'Цвет мет. опор'!A:B,2,0),\"/\",VLOOKUP($J$5,'Цвет лючка'!A:B,2,0),\".\",VLOOKUP($K$5,'Цвет столешницы'!A:B,2,FALSE))","v":"EVL730/П/60*30/ANT/ANT.U003"},null,"2210*2332*1098",null,86383]
["EVL731/П/60*30/",{"$f":"CONCATENATE(A129,VLOOKUP($I$5,'Цвет мет. опор'!A:B,2,0),\"/\",VLOOKUP($J$5,'Цвет лючка'!A:B,2,0),\".\",VLOOKUP($K$5,'Цвет столешницы'!A:B,2,FALSE))","v":"EVL731/П/60*30/ANT/ANT.U003"},"Рабочая станция на П образном м/к 60х30 с  тумбой левая/правая","1450*1250*750 L","правый",32859]
["EVL732/П/60*30/",{"$f":"CONCATENATE(A130,VLOOKUP($I$5,'Цвет мет. опор'!A:B,2,0),\"/\",VLOOKUP($J$5,'Цвет лючка'!A:B,2,0),\".\",VLOOKUP($K$5,'Цвет столешницы'!A:B,2,FALSE))","v":"EVL732/П/60*30/ANT/ANT.U003"},null,"1450*1250*750 R",null,32859]
["EVL733/П/60*30/",{"$f":"CONCATENATE(A131,VLOOKUP($I$5,'Цвет мет. опор'!A:B,2,0),\"/\",VLOOKUP($J$5,'Цвет лючка'!A:B,2,0),\".\",VLOOKUP($K$5,'Цвет столешницы'!A:B,2,FALSE))","v":"EVL733/П/60*30/ANT/ANT.U003"},null,"1650*1250*750 L",null,33492]
["EVL734/П/60*30/",{"$f":"CONCATENATE(A132,VLOOKUP($I$5,'Цвет мет. опор'!A:B,2,0),\"/\",VLOOKUP($J$5,'Цвет лючка'!A:B,2,0),\".\",VLOOKUP($K$5,'Цвет столешницы'!A:B,2,FALSE))","v":"EVL734/П/60*30/ANT/ANT.U003"},null,"1650*1250*750 R",null,34184]
["EVL735/П/60*30/",{"$f":"CONCATENATE(A133,VLOOKUP($I$5,'Цвет мет. опор'!A:B,2,0),\"/\",VLOOKUP($J$5,'Цвет лючка'!A:B,2,0),\".\",VLOOKUP($K$5,'Цвет столешницы'!A:B,2,FALSE))","v":"EVL735/П/60*30/ANT/ANT.U003"},null,"1850*1250*750 L",null,34418]
["EVL736/П/60*30/",{"$f":"CONCATENATE(A134,VLOOKUP($I$5,'Цвет мет. опор'!A:B,2,0),\"/\",VLOOKUP($J$5,'Цвет лючка'!A:B,2,0),\".\",VLOOKUP($K$5,'Цвет столешницы'!A:B,2,FALSE))","v":"EVL736/П/60*30/ANT/ANT.U003"},null,"1850*1250*750 R",null,35050]
[null,"Бэнч-системы"]
["EVL645/П/60*30/",{"$f":"CONCATENATE(A136,VLOOKUP($I$5,'Цвет мет. опор'!A:B,2,0),\"/\",VLOOKUP($J$5,'Цвет лючка'!A:B,2,0),\".\",VLOOKUP($K$5,'Цвет столешницы'!A:B,2,FALSE))","v":"EVL645/П/60*30/ANT/ANT.U003"},"Рабочая станция на 2 раб.места на П образном м/к 60х30 (бенч-система) глубиной 600","2400*600*750",null,34720]
["EVL646/П/60*30/",{"$f":"CONCATENATE(A137,VLOOKUP($I$5,'Цвет мет. опор'!A:B,2,0),\"/\",VLOOKUP($J$5,'Цвет лючка'!A:B,2,0),\".\",VLOOKUP($K$5,'Цвет столешницы'!A:B,2,FALSE))","v":"EVL646/П/60*30/ANT/ANT.U003"},null,"2800*600*750",null,35850]
["EVL647/П/60*30/",{"$f":"CONCATENATE(A138,VLOOKUP($I$5,'Цвет мет. опор'!A:B,2,0),\"/\",VLOOKUP($J$5,'Цвет лючка'!A:B,2,0),\".\",VLOOKUP($K$5,'Цвет столешницы'!A:B,2,FALSE))","v":"EVL647/П/60*30/ANT/ANT.U003"},null,"3200*600*750",null,37427]
["EVL648/П/60*30/",{"$f":"CONCATENATE(A139,VLOOKUP($I$5,'Цвет мет. опор'!A:B,2,0),\"/\",VLOOKUP($J$5,'Цвет лючка'!A:B,2,0),\".\",VLOOKUP($K$5,'Цвет столешницы'!A:B,2,FALSE))","v":"EVL648/П/60*30/ANT/ANT.U003"},"Рабочая станция на 2 раб.места на П образном м/к 60х30 (бенч-система) глубиной 700","2400*700*750",null,35784]
["EVL649/П/60*30/",{"$f":"CONCATENATE(A140,VLOOKUP($I$5,'Цвет мет. опор'!A:B,2,0),\"/\",VLOOKUP($J$5,'Цвет лючка'!A:B,2,0),\".\",VLOOKUP($K$5,'Цвет столешницы'!A:B,2,FALSE))","v":"EVL649/П/60*30/ANT/ANT.U003"},null,"2800*700*750",null,37243]
["EVL650/П/60*30/",{"$f":"CONCATENATE(A141,VLOOKUP($I$5,'Цвет мет. опор'!A:B,2,0),\"/\",VLOOKUP($J$5,'Цвет лючка'!A:B,2,0),\".\",VLOOKUP($K$5,'Цвет столешницы'!A:B,2,FALSE))","v":"EVL650/П/60*30/ANT/ANT.U003"},null,"3200*700*750",null,38598]
["EVL651/П/60*30/",{"$f":"CONCATENATE(A142,VLOOKUP($I$5,'Цвет мет. опор'!A:B,2,0),\"/\",VLOOKUP($J$5,'Цвет лючка'!A:B,2,0),\".\",VLOOKUP($K$5,'Цвет столешницы'!A:B,2,FALSE))","v":"EVL651/П/60*30/ANT/ANT.U003"},"Рабочая станция на 2 раб.места на П образном м/к 60х30 (бенч-система) глубиной 800","2400*800*750",null,37095]
["EVL652/П/60*30/",{"$f":"CONCATENATE(A143,VLOOKUP($I$5,'Цвет мет. опор'!A:B,2,0),\"/\",VLOOKUP($J$5,'Цвет лючка'!A:B,2,0),\".\",VLOOKUP($K$5,'Цвет столешницы'!A:B,2,FALSE))","v":"EVL652/П/60*30/ANT/ANT.U003"},null,"2800*800*750",null,38491]
["EVL653/П/60*30/",{"$f":"CONCATENATE(A144,VLOOKUP($I$5,'Цвет мет. опор'!A:B,2,0),\"/\",VLOOKUP($J$5,'Цвет лючка'!A:B,2,0),\".\",VLOOKUP($K$5,'Цвет столешницы'!A:B,2,FALSE))","v":"EVL653/П/60*30/ANT/ANT.U003"},null,"3200*800*750",null,39922]
["EVL654/П/60*30/",{"$f":"CONCATENATE(A145,VLOOKUP($I$5,'Цвет мет. опор'!A:B,2,0),\"/\",VLOOKUP($J$5,'Цвет лючка'!A:B,2,0),\".\",VLOOKUP($K$5,'Цвет столешницы'!A:B,2,FALSE))","v":"EVL654/П/60*30/ANT/ANT.U003"},"Рабочая станция на 3 раб.места на П образном м/к 60х30 (бенч-система), глубиной 600 мм","3600*600*750",null,52943]
["EVL655/П/60*30/",{"$f":"CONCATENATE(A146,VLOOKUP($I$5,'Цвет мет. опор'!A:B,2,0),\"/\",VLOOKUP($J$5,'Цвет лючка'!A:B,2,0),\".\",VLOOKUP($K$5,'Цвет столешницы'!A:B,2,FALSE))","v":"EVL655/П/60*30/ANT/ANT.U003"},null,"4200*600*750",null,55491]
["EVL656/П/60*30/",{"$f":"CONCATENATE(A147,VLOOKUP($I$5,'Цвет мет. опор'!A:B,2,0),\"/\",VLOOKUP($J$5,'Цвет лючка'!A:B,2,0),\".\",VLOOKUP($K$5,'Цвет столешницы'!A:B,2,FALSE))","v":"EVL656/П/60*30/ANT/ANT.U003"},null,"4800*600*750",null,57144]
["EVL657/П/60*30/",{"$f":"CONCATENATE(A148,VLOOKUP($I$5,'Цвет мет. опор'!A:B,2,0),\"/\",VLOOKUP($J$5,'Цвет лючка'!A:B,2,0),\".\",VLOOKUP($K$5,'Цвет столешницы'!A:B,2,FALSE))","v":"EVL657/П/60*30/ANT/ANT.U003"},"Рабочая станция на 3 раб.места на П образном м/к 60х30 (бенч-система), глубиной 700 мм","3600*700*750",null,52637]
["EVL658/П/60*30/",{"$f":"CONCATENATE(A149,VLOOKUP($I$5,'Цвет мет. опор'!A:B,2,0),\"/\",VLOOKUP($J$5,'Цвет лючка'!A:B,2,0),\".\",VLOOKUP($K$5,'Цвет столешницы'!A:B,2,FALSE))","v":"EVL658/П/60*30/ANT/ANT.U003"},null,"4200*700*750",null,54722]
["EVL659/П/60*30/",{"$f":"CONCATENATE(A150,VLOOKUP($I$5,'Цвет мет. опор'!A:B,2,0),\"/\",VLOOKUP($J$5,'Цвет лючка'!A:B,2,0),\".\",VLOOKUP($K$5,'Цвет столешницы'!A:B,2,FALSE))","v":"EVL659/П/60*30/ANT/ANT.U003"},null,"4800*700*750",null,57682]
["EVL660/П/60*30/",{"$f":"CONCATENATE(A151,VLOOKUP($I$5,'Цвет мет. опор'!A:B,2,0),\"/\",VLOOKUP($J$5,'Цвет лючка'!A:B,2,0),\".\",VLOOKUP($K$5,'Цвет столешницы'!A:B,2,FALSE))","v":"EVL660/П/60*30/ANT/ANT.U003"},"Рабочая станция на 3 раб.места на П образном м/к 60х30 (бенч-система), глубиной 800 мм","3600*800*750",null,53482]
["EVL661/П/60*30/",{"$f":"CONCATENATE(A152,VLOOKUP($I$5,'Цвет мет. опор'!A:B,2,0),\"/\",VLOOKUP($J$5,'Цвет лючка'!A:B,2,0),\".\",VLOOKUP($K$5,'Цвет столешницы'!A:B,2,FALSE))","v":"EVL661/П/60*30/ANT/ANT.U003"},null,"4200*800*750",null,56029]
["EVL662/П/60*30/",{"$f":"CONCATENATE(A153,VLOOKUP($I$5,'Цвет мет. опор'!A:B,2,0),\"/\",VLOOKUP($J$5,'Цвет лючка'!A:B,2,0),\".\",VLOOKUP($K$5,'Цвет столешницы'!A:B,2,FALSE))","v":"EVL662/П/60*30/ANT/ANT.U003"},null,"4800*800*750",null,58546]
["EVL663/П/60*30/",{"$f":"CONCATENATE(A154,VLOOKUP($I$5,'Цвет мет. опор'!A:B,2,0),\"/\",VLOOKUP($J$5,'Цвет лючка'!A:B,2,0),\".\",VLOOKUP($K$5,'Цвет столешницы'!A:B,2,FALSE))","v":"EVL663/П/60*30/ANT/ANT.U003"},"Рабочая станция на 4 раб.места на П образном м/к 60х30","2400*1236*750",null,59703]
["EVL664/П/60*30/",{"$f":"CONCATENATE(A155,VLOOKUP($I$5,'Цвет мет. опор'!A:B,2,0),\"/\",VLOOKUP($J$5,'Цвет лючка'!A:B,2,0),\".\",VLOOKUP($K$5,'Цвет столешницы'!A:B,2,FALSE))","v":"EVL664/П/60*30/ANT/ANT.U003"},null,"2800*1236*750",null,62656]
["EVL665/П/60*30/",{"$f":"CONCATENATE(A156,VLOOKUP($I$5,'Цвет мет. опор'!A:B,2,0),\"/\",VLOOKUP($J$5,'Цвет лючка'!A:B,2,0),\".\",VLOOKUP($K$5,'Цвет столешницы'!A:B,2,FALSE))","v":"EVL665/П/60*30/ANT/ANT.U003"},null,"3200*1236*750",null,65091]
["EVL666/П/60*30/",{"$f":"CONCATENATE(A157,VLOOKUP($I$5,'Цвет мет. опор'!A:B,2,0),\"/\",VLOOKUP($J$5,'Цвет лючка'!A:B,2,0),\".\",VLOOKUP($K$5,'Цвет столешницы'!A:B,2,FALSE))","v":"EVL666/П/60*30/ANT/ANT.U003"},"Рабочая станция на 4 раб.места на П образном м/к 60х30","2400*1436*750",null,54435]
["EVL667/П/60*30/",{"$f":"CONCATENATE(A158,VLOOKUP($I$5,'Цвет мет. опор'!A:B,2,0),\"/\",VLOOKUP($J$5,'Цвет лючка'!A:B,2,0),\".\",VLOOKUP($K$5,'Цвет столешницы'!A:B,2,FALSE))","v":"EVL667/П/60*30/ANT/ANT.U003"},null,"2800*1436*750",null,65248]
["EVL668/П/60*30/",{"$f":"CONCATENATE(A159,VLOOKUP($I$5,'Цвет мет. опор'!A:B,2,0),\"/\",VLOOKUP($J$5,'Цвет лючка'!A:B,2,0),\".\",VLOOKUP($K$5,'Цвет столешницы'!A:B,2,FALSE))","v":"EVL668/П/60*30/ANT/ANT.U003"},null,"3200*1436*750",null,67958]
["EVL669/П/60*30/",{"$f":"CONCATENATE(A160,VLOOKUP($I$5,'Цвет мет. опор'!A:B,2,0),\"/\",VLOOKUP($J$5,'Цвет лючка'!A:B,2,0),\".\",VLOOKUP($K$5,'Цвет столешницы'!A:B,2,FALSE))","v":"EVL669/П/60*30/ANT/ANT.U003"},"Рабочая станция на 4 раб.места на П образном м/к 60х30","2400*1636*750",null,65584]
["EVL670/П/60*30/",{"$f":"CONCATENATE(A161,VLOOKUP($I$5,'Цвет мет. опор'!A:B,2,0),\"/\",VLOOKUP($J$5,'Цвет лючка'!A:B,2,0),\".\",VLOOKUP($K$5,'Цвет столешницы'!A:B,2,FALSE))","v":"EVL670/П/60*30/ANT/ANT.U003"},null,"2800*1636*750",null,68378]
["EVL671/П/60*30/",{"$f":"CONCATENATE(A162,VLOOKUP($I$5,'Цвет мет. опор'!A:B,2,0),\"/\",VLOOKUP($J$5,'Цвет лючка'!A:B,2,0),\".\",VLOOKUP($K$5,'Цвет столешницы'!A:B,2,FALSE))","v":"EVL671/П/60*30/ANT/ANT.U003"},null,"3200*1636*750",null,71238]
["EVL672/П/60*30/",{"$f":"CONCATENATE(A163,VLOOKUP($I$5,'Цвет мет. опор'!A:B,2,0),\"/\",VLOOKUP($J$5,'Цвет лючка'!A:B,2,0),\".\",VLOOKUP($K$5,'Цвет столешницы'!A:B,2,FALSE))","v":"EVL672/П/60*30/ANT/ANT.U003"},"Рабочая станция на 6 раб.места на П образном м/к 30х60 с шириной 1-го рабочего места 600 мм","3600*1236*750",null,88096]
["EVL673/П/60*30/",{"$f":"CONCATENATE(A164,VLOOKUP($I$5,'Цвет мет. опор'!A:B,2,0),\"/\",VLOOKUP($J$5,'Цвет лючка'!A:B,2,0),\".\",VLOOKUP($K$5,'Цвет столешницы'!A:B,2,FALSE))","v":"EVL673/П/60*30/ANT/ANT.U003"},null,"4200*1236*750",null,92527]
["EVL674/П/60*30/",{"$f":"CONCATENATE(A165,VLOOKUP($I$5,'Цвет мет. опор'!A:B,2,0),\"/\",VLOOKUP($J$5,'Цвет лючка'!A:B,2,0),\".\",VLOOKUP($K$5,'Цвет столешницы'!A:B,2,FALSE))","v":"EVL674/П/60*30/ANT/ANT.U003"},null,"4800*1236*750",null,97258]
["EVL675/П/60*30/",{"$f":"CONCATENATE(A166,VLOOKUP($I$5,'Цвет мет. опор'!A:B,2,0),\"/\",VLOOKUP($J$5,'Цвет лючка'!A:B,2,0),\".\",VLOOKUP($K$5,'Цвет столешницы'!A:B,2,FALSE))","v":"EVL675/П/60*30/ANT/ANT.U003"},"Рабочая станция на 6 раб.места на П образном м/к 30х60 с шириной 1-го рабочего места 700 мм","3600*1436*750",null,91994]
["EVL676/П/60*30/",{"$f":"CONCATENATE(A167,VLOOKUP($I$5,'Цвет мет. опор'!A:B,2,0),\"/\",VLOOKUP($J$5,'Цвет лючка'!A:B,2,0),\".\",VLOOKUP($K$5,'Цвет столешницы'!A:B,2,FALSE))","v":"EVL676/П/60*30/ANT/ANT.U003"},null,"4200*1436*750",null,96370]
["EVL677/П/60*30/",{"$f":"CONCATENATE(A168,VLOOKUP($I$5,'Цвет мет. опор'!A:B,2,0),\"/\",VLOOKUP($J$5,'Цвет лючка'!A:B,2,0),\".\",VLOOKUP($K$5,'Цвет столешницы'!A:B,2,FALSE))","v":"EVL677/П/60*30/ANT/ANT.U003"},null,"4800*1436*750",null,106483]
["EVL678/П/60*30/",{"$f":"CONCATENATE(A169,VLOOKUP($I$5,'Цвет мет. опор'!A:B,2,0),\"/\",VLOOKUP($J$5,'Цвет лючка'!A:B,2,0),\".\",VLOOKUP($K$5,'Цвет столешницы'!A:B,2,FALSE))","v":"EVL678/П/60*30/ANT/ANT.U003"},"Рабочая станция на 6 раб.места на П образном м/к 30х60 с шириной 1-го рабочего места 800 мм","3600*1636*750",null,96664]
["EVL679/П/60*30/",{"$f":"CONCATENATE(A170,VLOOKUP($I$5,'Цвет мет. опор'!A:B,2,0),\"/\",VLOOKUP($J$5,'Цвет лючка'!A:B,2,0),\".\",VLOOKUP($K$5,'Цвет столешницы'!A:B,2,FALSE))","v":"EVL679/П/60*30/ANT/ANT.U003"},null,"4200*1636*750",null,102492]
["EVL680/П/60*30/",{"$f":"CONCATENATE(A171,VLOOKUP($I$5,'Цвет мет. опор'!A:B,2,0),\"/\",VLOOKUP($J$5,'Цвет лючка'!A:B,2,0),\".\",VLOOKUP($K$5,'Цвет столешницы'!A:B,2,FALSE))","v":"EVL680/П/60*30/ANT/ANT.U003"},null,"4800*1636*750",null,105145]
[null,"Переговорные столы"]
["EVL800/П/60*30/",{"$f":"CONCATENATE(A173,VLOOKUP($I$5,'Цвет мет. опор'!A:B,2,0),\".\",VLOOKUP($K$5,'Цвет столешницы'!A:B,2,FALSE))","v":"EVL800/П/60*30/ANT.U003"},"Переговорный стол (1 столешница) \nна П образном м/к 60х30","1000*1236*750",null,27715]
["EVL801/П/60*30/",{"$f":"CONCATENATE(A174,VLOOKUP($I$5,'Цвет мет. опор'!A:B,2,0),\".\",VLOOKUP($K$5,'Цвет столешницы'!A:B,2,FALSE))","v":"EVL801/П/60*30/ANT.U003"},null,"1200*1236*750",null,28735]
["EVL802/П/60*30/",{"$f":"CONCATENATE(A175,VLOOKUP($I$5,'Цвет мет. опор'!A:B,2,0),\".\",VLOOKUP($K$5,'Цвет столешницы'!A:B,2,FALSE))","v":"EVL802/П/60*30/ANT.U003"},null,"1400*1236*750",null,33345]
["EVL803/П/60*30/",{"$f":"CONCATENATE(A176,VLOOKUP($I$5,'Цвет мет. опор'!A:B,2,0),\".\",VLOOKUP($K$5,'Цвет столешницы'!A:B,2,FALSE))","v":"EVL803/П/60*30/ANT.U003"},null,"1600*1236*750",null,35064]
["EVL804/П/60*30/",{"$f":"CONCATENATE(A177,VLOOKUP($I$5,'Цвет мет. опор'!A:B,2,0),\".\",VLOOKUP($K$5,'Цвет столешницы'!A:B,2,FALSE))","v":"EVL804/П/60*30/ANT.U003"},null,"1800*1236*750",null,36958]
["EVL805/П/60*30/",{"$f":"CONCATENATE(A178,VLOOKUP($I$5,'Цвет мет. опор'!A:B,2,0),\".\",VLOOKUP($K$5,'Цвет столешницы'!A:B,2,FALSE))","v":"EVL805/П/60*30/ANT.U003"},"Переговорный стол (2 столешницы)\n на П образном м/к 60х30","2000*1236*750",null,52462]
["EVL806/П/60*30/",{"$f":"CONCATENATE(A179,VLOOKUP($I$5,'Цвет мет. опор'!A:B,2,0),\".\",VLOOKUP($K$5,'Цвет столешницы'!A:B,2,FALSE))","v":"EVL806/П/60*30/ANT.U003"},null,"2400*1236*750",null,54555]
["EVL807/П/60*30/",{"$f":"CONCATENATE(A180,VLOOKUP($I$5,'Цвет мет. опор'!A:B,2,0),\".\",VLOOKUP($K$5,'Цвет столешницы'!A:B,2,FALSE))","v":"EVL807/П/60*30/ANT.U003"},null,"2800*1236*750",null,57048]
["EVL808/П/60*30/",{"$f":"CONCATENATE(A181,VLOOKUP($I$5,'Цвет мет. опор'!A:B,2,0),\".\",VLOOKUP($K$5,'Цвет столешницы'!A:B,2,FALSE))","v":"EVL808/П/60*30/ANT.U003"},null,"3200*1236*750",null,67211]
["EVL809/П/60*30/",{"$f":"CONCATENATE(A182,VLOOKUP($I$5,'Цвет мет. опор'!A:B,2,0),\".\",VLOOKUP($K$5,'Цвет столешницы'!A:B,2,FALSE))","v":"EVL809/П/60*30/ANT.U003"},null,"3600*1236*750",null,71000]
["EVL810/П/60*30/",{"$f":"CONCATENATE(A183,VLOOKUP($I$5,'Цвет мет. опор'!A:B,2,0),\".\",VLOOKUP($K$5,'Цвет столешницы'!A:B,2,FALSE))","v":"EVL810/П/60*30/ANT.U003"},"Переговорный стол (3 столешницы)\n на П образном м/к 60х30","3000*1236*750",null,73461]
["EVL811/П/60*30/",{"$f":"CONCATENATE(A184,VLOOKUP($I$5,'Цвет мет. опор'!A:B,2,0),\".\",VLOOKUP($K$5,'Цвет столешницы'!A:B,2,FALSE))","v":"EVL811/П/60*30/ANT.U003"},null,"3600*1236*750",null,80374]
["EVL812/П/60*30/",{"$f":"CONCATENATE(A185,VLOOKUP($I$5,'Цвет мет. опор'!A:B,2,0),\".\",VLOOKUP($K$5,'Цвет столешницы'!A:B,2,FALSE))","v":"EVL812/П/60*30/ANT.U003"},null,"4200*1236*750",null,84114]
["EVL813/П/60*30/",{"$f":"CONCATENATE(A186,VLOOKUP($I$5,'Цвет мет. опор'!A:B,2,0),\".\",VLOOKUP($K$5,'Цвет столешницы'!A:B,2,FALSE))","v":"EVL813/П/60*30/ANT.U003"},null,"4800*1236*750",null,86546]
["EVL814/П/60*30/",{"$f":"CONCATENATE(A187,VLOOKUP($I$5,'Цвет мет. опор'!A:B,2,0),\".\",VLOOKUP($K$5,'Цвет столешницы'!A:B,2,FALSE))","v":"EVL814/П/60*30/ANT.U003"},null,"5400*1236*750",null,89641]
["EVL841/П/60*30/",{"$f":"CONCATENATE(A188,VLOOKUP($I$5,'Цвет мет. опор'!A:B,2,0),\".\",VLOOKUP($K$5,'Цвет столешницы'!A:B,2,FALSE))","v":"EVL841/П/60*30/ANT.U003"},"Переговорный стол (3 столешницы)\n на П-образном м/к 60х30","3600*1436*750",null,82796]
["EVL842/П/60*30/",{"$f":"CONCATENATE(A189,VLOOKUP($I$5,'Цвет мет. опор'!A:B,2,0),\".\",VLOOKUP($K$5,'Цвет столешницы'!A:B,2,FALSE))","v":"EVL842/П/60*30/ANT.U003"},null,"4200*1436*750",null,86644]
["EVL843/П/60*30/",{"$f":"CONCATENATE(A190,VLOOKUP($I$5,'Цвет мет. опор'!A:B,2,0),\".\",VLOOKUP($K$5,'Цвет столешницы'!A:B,2,FALSE))","v":"EVL843/П/60*30/ANT.U003"},null,"4800*1436*750",null,89175]
["EVL844/П/60*30/",{"$f":"CONCATENATE(A191,VLOOKUP($I$5,'Цвет мет. опор'!A:B,2,0),\".\",VLOOKUP($K$5,'Цвет столешницы'!A:B,2,FALSE))","v":"EVL844/П/60*30/ANT.U003"},null,"5400*1436*750",null,91306]
[null,null,"Кодировка Артикула стола"]
[null,null,"Модель стола разворот стола /Цвет опор/Цв. заглушки. Цвет столешницы  "]
[null,"МОДЕЛЬ СТОЛА (ФОРМА, РАЗМЕР)","ПРАВОСТОРОННИЙ /ЛЕВОСТОРОННИЙ","ЦВЕТ ОПОР","ЦВЕТ ЗАГЛУШКИ, РУЧЕК","ЦВЕТ СТОЛЕШНИЦЫ"]
[null,null,"SX-левый","АNT-АНТРАЦИТ","АNT-АНТРАЦИТ","H","Белый"]
[null,null,"DX-правый","WHT-БЕЛЫЙ ","H-БЕЛЫЙ ","U727 ","Серый Камень"]
[null,null,null,"GR-СЕРЫЙ","G-СЕРЫЙ","R2","Серый"]
[null,null,null,null,null,"ANT","Антрацит"]
[null,null,null,null,null,"U003","Дуб Честерфилд"]
[null,null,null,null,null,"L","Дуб 131"]

{"sheet":"Столы на А обр. 60х30","index":3,"n_rows":191,"n_cols":11,"rows_kept":191,"cut":false,"hidden":false,"merged":[[184,5,184,6],[53,2,56,2],[53,4,56,4],[57,4,60,4],[57,2,60,2],[61,4,64,4],[61,2,64,2],[159,2,161,2],[65,2,67,2],[159,4,161,4],[68,2,70,2],[68,4,70,4],[138,2,140,2],[129,2,131,2],[132,2,134,2],[105,2,109,2],[144,2,146,2],[147,2,149,2],[144,4,146,4],[95,2,99,2],[73,4,74,4],[77,4,79,4],[138,4,140,4],[95,4,99,4],[1,1,1,5],[178,2,181,2],[71,4,72,4],[6,2,9,2],[15,2,19,2],[6,4,9,4],[10,2,14,2],[10,4,14,4],[15,4,19,4],[2,1,4,5],[21,3,22,3],[23,3,24,3],[21,5,22,5],[25,3,26,3],[27,3,28,3],[110,2,114,2],[115,2,119,2],[120,2,124,2],[173,2,177,2],[163,4,167,4],[168,4,172,4],[173,4,177,4],[168,2,172,2],[65,4,67,4],[73,2,74,2],[75,2,76,2],[77,2,79,2],[75,4,76,4],[147,4,149,4],[141,4,143,4],[100,4,104,4],[156,2,158,2],[129,4,131,4],[132,4,134,4],[153,4,155,4],[156,4,158,4],[141,2,143,2],[150,4,152,4],[135,4,137,4],[105,4,109,4],[110,4,114,4],[115,4,119,4],[120,4,124,4],[135,2,137,2],[23,5,24,5],[21,2,24,2],[21,4,24,4],[178,4,181,4],[2,8,2,10],[150,2,152,2],[163,2,167,2],[80,2,82,2],[83,2,85,2],[86,2,88,2],[89,2,91,2],[92,2,94,2],[92,4,94,4],[80,4,82,4],[83,4,85,4],[86,4,88,4],[89,4,91,4],[71,2,72,2],[126,4,128,4],[100,2,104,2],[126,2,128,2],[153,2,155,2],[31,5,32,5],[33,5,34,5],[31,2,34,2],[31,4,34,4],[29,3,30,3],[25,2,30,2],[25,4,30,4],[31,3,32,3],[33,3,34,3],[25,5,26,5],[27,5,28,5],[29,5,30,5],[35,4,40,4],[35,2,40,2],[35,3,36,3],[37,3,38,3],[39,3,40,3],[35,5,36,5],[37,5,38,5],[39,5,40,5],[51,3,52,3],[49,5,50,5],[51,5,52,5],[49,4,52,4],[41,2,44,2],[45,2,48,2],[45,3,46,3],[47,3,48,3],[49,3,50,3],[49,2,52,2],[47,5,48,5],[41,4,44,4],[45,4,48,4],[41,3,42,3],[43,3,44,3],[41,5,42,5],[43,5,44,5],[45,5,46,5]]}
[null,"EVOLUTION",null,null,null,{"$f":"Склаская!$F$1","v":"2025-05-23"}]
[null,"Столы, бенчи и рабочие станции на металлокаркасе: А-образные опоры - прямоугольная труба с сечением 60*30мм, траверсы - труба 40*20мм."]
[null,"Не складская программа производятся на заказ партией от 6 шт., со сроком по согласованию с производством, в цвете: Дуб Честерфилд, Белый, Антрацит, Серый R2, Дуб 131, Серый камень, Венге Цаво, Бетон. \nОпоры столов в цв. Антрацит, Белый, Серый.\nЗаглушки кабель-каналов и ручки тумб Антрацит, Белый.\nДля заказа изделия следует пользоваться правилами кодировки для создания  артикула.  →→→",null,null,null,null,null,null,"Формирование артикула \nв зависимости от выбранных характеристик"]
[null,null,null,null,null,null,null,null,"Цвет Опор","Цвет кабель-канала","Цвет столешницы"]
[null,null,null,null,null,null,null,null,"Антрацит","Антрацит","Дуб Честерфилд"]
[null,"Артикул","Наименование","Размеры Ш*Г*В (мм)","Изображение","Розничная Цена, руб."]
["EVL113/А/60*30/",{"$f":"CONCATENATE(A7,VLOOKUP($I$5,'Цвет мет. опор'!A:B,2,0),\"/\",VLOOKUP($J$5,'Цвет лючка'!A:B,2,0),\".\",VLOOKUP($K$5,'Цвет столешницы'!A:B,2,FALSE))","v":"EVL113/А/60*30/ANT/ANT.U003"},"Стол письменный на А-образном м/к 60х30, глубиной 600 мм","1000*600*750",null,17745]
["EVL114/А/60*30/",{"$f":"CONCATENATE(A8,VLOOKUP($I$5,'Цвет мет. опор'!A:B,2,0),\"/\",VLOOKUP($J$5,'Цвет лючка'!A:B,2,0),\".\",VLOOKUP($K$5,'Цвет столешницы'!A:B,2,FALSE))","v":"EVL114/А/60*30/ANT/ANT.U003"},null,"1200*600*750",null,18312]
["EVL115/А/60*30/",{"$f":"CONCATENATE(A9,VLOOKUP($I$5,'Цвет мет. опор'!A:B,2,0),\"/\",VLOOKUP($J$5,'Цвет лючка'!A:B,2,0),\".\",VLOOKUP($K$5,'Цвет столешницы'!A:B,2,FALSE))","v":"EVL115/А/60*30/ANT/ANT.U003"},null,"1400*600*750",null,18757]
["EVL116/А/60*30/",{"$f":"CONCATENATE(A10,VLOOKUP($I$5,'Цвет мет. опор'!A:B,2,0),\"/\",VLOOKUP($J$5,'Цвет лючка'!A:B,2,0),\".\",VLOOKUP($K$5,'Цвет столешницы'!A:B,2,FALSE))","v":"EVL116/А/60*30/ANT/ANT.U003"},null,"1600*600*750",null,19804]
["EVL100/А/60*30/",{"$f":"CONCATENATE(A11,VLOOKUP($I$5,'Цвет мет. опор'!A:B,2,0),\"/\",VLOOKUP($J$5,'Цвет лючка'!A:B,2,0),\".\",VLOOKUP($K$5,'Цвет столешницы'!A:B,2,FALSE))","v":"EVL100/А/60*30/ANT/ANT.U003"},"Стол письменный на А-образном м/к 60х30, глубиной 700 мм","1000*700*750",null,18465]
["EVL101/А/60*30/",{"$f":"CONCATENATE(A12,VLOOKUP($I$5,'Цвет мет. опор'!A:B,2,0),\"/\",VLOOKUP($J$5,'Цвет лючка'!A:B,2,0),\".\",VLOOKUP($K$5,'Цвет столешницы'!A:B,2,FALSE))","v":"EVL101/А/60*30/ANT/ANT.U003"},null,"1200*700*750",null,19103]
["EVL102/А/60*30/",{"$f":"CONCATENATE(A13,VLOOKUP($I$5,'Цвет мет. опор'!A:B,2,0),\"/\",VLOOKUP($J$5,'Цвет лючка'!A:B,2,0),\".\",VLOOKUP($K$5,'Цвет столешницы'!A:B,2,FALSE))","v":"EVL102/А/60*30/ANT/ANT.U003"},null,"1400*700*750",null,19832]
["EVL103/А/60*30/",{"$f":"CONCATENATE(A14,VLOOKUP($I$5,'Цвет мет. опор'!A:B,2,0),\"/\",VLOOKUP($J$5,'Цвет лючка'!A:B,2,0),\".\",VLOOKUP($K$5,'Цвет столешницы'!A:B,2,FALSE))","v":"EVL103/А/60*30/ANT/ANT.U003"},null,"1600*700*750",null,20793]
["EVL104/А/60*30/",{"$f":"CONCATENATE(A15,VLOOKUP($I$5,'Цвет мет. опор'!A:B,2,0),\"/\",VLOOKUP($J$5,'Цвет лючка'!A:B,2,0),\".\",VLOOKUP($K$5,'Цвет столешницы'!A:B,2,FALSE))","v":"EVL104/А/60*30/ANT/ANT.U003"},null,"1800*700*750",null,21474]
["EVL117/А/60*30/",{"$f":"CONCATENATE(A16,VLOOKUP($I$5,'Цвет мет. опор'!A:B,2,0),\"/\",VLOOKUP($J$5,'Цвет лючка'!A:B,2,0),\".\",VLOOKUP($K$5,'Цвет столешницы'!A:B,2,FALSE))","v":"EVL117/А/60*30/ANT/ANT.U003"},"Стол письменный на А-образном м/к 60х30, глубиной 800 мм","1000*800*750",null,18783]
["EVL118/А/60*30/",{"$f":"CONCATENATE(A17,VLOOKUP($I$5,'Цвет мет. опор'!A:B,2,0),\"/\",VLOOKUP($J$5,'Цвет лючка'!A:B,2,0),\".\",VLOOKUP($K$5,'Цвет столешницы'!A:B,2,FALSE))","v":"EVL118/А/60*30/ANT/ANT.U003"},null,"1200*800*750",null,19885]
["EVL119/А/60*30/",{"$f":"CONCATENATE(A18,VLOOKUP($I$5,'Цвет мет. опор'!A:B,2,0),\"/\",VLOOKUP($J$5,'Цвет лючка'!A:B,2,0),\".\",VLOOKUP($K$5,'Цвет столешницы'!A:B,2,FALSE))","v":"EVL119/А/60*30/ANT/ANT.U003"},null,"1400*800*750",null,20589]
["EVL120/А/60*30/",{"$f":"CONCATENATE(A19,VLOOKUP($I$5,'Цвет мет. опор'!A:B,2,0),\"/\",VLOOKUP($J$5,'Цвет лючка'!A:B,2,0),\".\",VLOOKUP($K$5,'Цвет столешницы'!A:B,2,FALSE))","v":"EVL120/А/60*30/ANT/ANT.U003"},null,"1600*800*750",null,21482]
["EVL121/А/60*30/",{"$f":"CONCATENATE(A20,VLOOKUP($I$5,'Цвет мет. опор'!A:B,2,0),\"/\",VLOOKUP($J$5,'Цвет лючка'!A:B,2,0),\".\",VLOOKUP($K$5,'Цвет столешницы'!A:B,2,FALSE))","v":"EVL121/А/60*30/ANT/ANT.U003"},null,"1800*800*750",null,22351]
["EVL122/А/60*30/",{"$f":"CONCATENATE(A21,VLOOKUP($I$5,'Цвет мет. опор'!A:B,2,0),\"/\",VLOOKUP($J$5,'Цвет лючка'!A:B,2,0),\".\",VLOOKUP($K$5,'Цвет столешницы'!A:B,2,FALSE))","v":"EVL122/А/60*30/ANT/ANT.U003"},"Стол письменный на А-образном м/к 60х30, глубиной 900 мм","1800*900*750",null,23881]
["EVL123SX/А/60*30/",{"$f":"CONCATENATE(A22,VLOOKUP($I$5,'Цвет мет. опор'!A:B,2,0),\"/\",VLOOKUP($J$5,'Цвет лючка'!A:B,2,0),\".\",VLOOKUP($K$5,'Цвет столешницы'!A:B,2,FALSE))","v":"EVL123SX/А/60*30/ANT/ANT.U003"},"Стол криволинейный левый/правый на А-образном м/к 60х30, глубиной 600/900 мм","1200*900*750","правый",19678]
["EVL123DX/А/60*30/",{"$f":"CONCATENATE(A23,VLOOKUP($I$5,'Цвет мет. опор'!A:B,2,0),\"/\",VLOOKUP($J$5,'Цвет лючка'!A:B,2,0),\".\",VLOOKUP($K$5,'Цвет столешницы'!A:B,2,FALSE))","v":"EVL123DX/А/60*30/ANT/ANT.U003"}]
["EVL124SX/А/60*30/",{"$f":"CONCATENATE(A24,VLOOKUP($I$5,'Цвет мет. опор'!A:B,2,0),\"/\",VLOOKUP($J$5,'Цвет лючка'!A:B,2,0),\".\",VLOOKUP($K$5,'Цвет столешницы'!A:B,2,FALSE))","v":"EVL124SX/А/60*30/ANT/ANT.U003"},null,"1400*900*750",null,20427]
["EVL124DX/А/60*30/",{"$f":"CONCATENATE(A25,VLOOKUP($I$5,'Цвет мет. опор'!A:B,2,0),\"/\",VLOOKUP($J$5,'Цвет лючка'!A:B,2,0),\".\",VLOOKUP($K$5,'Цвет столешницы'!A:B,2,FALSE))","v":"EVL124DX/А/60*30/ANT/ANT.U003"}]
["EVL105SX/А/60*30/",{"$f":"CONCATENATE(A26,VLOOKUP($I$5,'Цвет мет. опор'!A:B,2,0),\"/\",VLOOKUP($J$5,'Цвет лючка'!A:B,2,0),\".\",VLOOKUP($K$5,'Цвет столешницы'!A:B,2,FALSE))","v":"EVL105SX/А/60*30/ANT/ANT.U003"},"Стол криволинейный левый/правый на А-образном м/к 60х30, глубиной 700/900 мм","1200*900*750","правый",19353]
["EVL105DX/А/60*30/",{"$f":"CONCATENATE(A27,VLOOKUP($I$5,'Цвет мет. опор'!A:B,2,0),\"/\",VLOOKUP($J$5,'Цвет лючка'!A:B,2,0),\".\",VLOOKUP($K$5,'Цвет столешницы'!A:B,2,FALSE))","v":"EVL105DX/А/60*30/ANT/ANT.U003"}]
["EVL106SX/А/60*30/",{"$f":"CONCATENATE(A28,VLOOKUP($I$5,'Цвет мет. опор'!A:B,2,0),\"/\",VLOOKUP($J$5,'Цвет лючка'!A:B,2,0),\".\",VLOOKUP($K$5,'Цвет столешницы'!A:B,2,FALSE))","v":"EVL106SX/А/60*30/ANT/ANT.U003"},null,"1400*900*750",null,20213]
["EVL106DX/А/60*30/",{"$f":"CONCATENATE(A29,VLOOKUP($I$5,'Цвет мет. опор'!A:B,2,0),\"/\",VLOOKUP($J$5,'Цвет лючка'!A:B,2,0),\".\",VLOOKUP($K$5,'Цвет столешницы'!A:B,2,FALSE))","v":"EVL106DX/А/60*30/ANT/ANT.U003"}]
["EVL107SX/А/60*30/",{"$f":"CONCATENATE(A30,VLOOKUP($I$5,'Цвет мет. опор'!A:B,2,0),\"/\",VLOOKUP($J$5,'Цвет лючка'!A:B,2,0),\".\",VLOOKUP($K$5,'Цвет столешницы'!A:B,2,FALSE))","v":"EVL107SX/А/60*30/ANT/ANT.U003"},null,"1600*900*750",null,21128]
["EVL107SX/А/60*30/",{"$f":"CONCATENATE(A31,VLOOKUP($I$5,'Цвет мет. опор'!A:B,2,0),\"/\",VLOOKUP($J$5,'Цвет лючка'!A:B,2,0),\".\",VLOOKUP($K$5,'Цвет столешницы'!A:B,2,FALSE))","v":"EVL107SX/А/60*30/ANT/ANT.U003"}]
["EVL125SX/А/60*30/",{"$f":"CONCATENATE(A32,VLOOKUP($I$5,'Цвет мет. опор'!A:B,2,0),\"/\",VLOOKUP($J$5,'Цвет лючка'!A:B,2,0),\".\",VLOOKUP($K$5,'Цвет столешницы'!A:B,2,FALSE))","v":"EVL125SX/А/60*30/ANT/ANT.U003"},"Стол криволинейный левый/правый на А-образном м/к 60х30, глубиной 800/900 мм","1400*900*750",null,21370]
["EVL125DX/А/60*30/",{"$f":"CONCATENATE(A33,VLOOKUP($I$5,'Цвет мет. опор'!A:B,2,0),\"/\",VLOOKUP($J$5,'Цвет лючка'!A:B,2,0),\".\",VLOOKUP($K$5,'Цвет столешницы'!A:B,2,FALSE))","v":"EVL125DX/А/60*30/ANT/ANT.U003"}]
["EVL126SX/А/60*30/",{"$f":"CONCATENATE(A34,VLOOKUP($I$5,'Цвет мет. опор'!A:B,2,0),\"/\",VLOOKUP($J$5,'Цвет лючка'!A:B,2,0),\".\",VLOOKUP($K$5,'Цвет столешницы'!A:B,2,FALSE))","v":"EVL126SX/А/60*30/ANT/ANT.U003"},null,"1600*900*750",null,21977]
["EVL126DX/А/60*30/",{"$f":"CONCATENATE(A35,VLOOKUP($I$5,'Цвет мет. опор'!A:B,2,0),\"/\",VLOOKUP($J$5,'Цвет лючка'!A:B,2,0),\".\",VLOOKUP($K$5,'Цвет столешницы'!A:B,2,FALSE))","v":"EVL126DX/А/60*30/ANT/ANT.U003"}]
["EVL109SX/А/60*30",{"$f":"CONCATENATE(A36,VLOOKUP($I$5,'Цвет мет. опор'!A:B,2,0),\"/\",VLOOKUP($J$5,'Цвет лючка'!A:B,2,0),\".\",VLOOKUP($K$5,'Цвет столешницы'!A:B,2,FALSE))","v":"EVL109SX/А/60*30ANT/ANT.U003"},"Стол эргономичный левый/правый на А-образном м/к 60х30, глубиной 700/900 мм","1200х900/700х750",null,15928]
["EVL109DX/А/60*31",{"$f":"CONCATENATE(A37,VLOOKUP($I$5,'Цвет мет. опор'!A:B,2,0),\"/\",VLOOKUP($J$5,'Цвет лючка'!A:B,2,0),\".\",VLOOKUP($K$5,'Цвет столешницы'!A:B,2,FALSE))","v":"EVL109DX/А/60*31ANT/ANT.U003"}]
["EVL110SX/А/60*30",{"$f":"CONCATENATE(A38,VLOOKUP($I$5,'Цвет мет. опор'!A:B,2,0),\"/\",VLOOKUP($J$5,'Цвет лючка'!A:B,2,0),\".\",VLOOKUP($K$5,'Цвет столешницы'!A:B,2,FALSE))","v":"EVL110SX/А/60*30ANT/ANT.U003"},null,"1400х900/700х750",null,16547]
["EVL110DX/А/60*31",{"$f":"CONCATENATE(A39,VLOOKUP($I$5,'Цвет мет. опор'!A:B,2,0),\"/\",VLOOKUP($J$5,'Цвет лючка'!A:B,2,0),\".\",VLOOKUP($K$5,'Цвет столешницы'!A:B,2,FALSE))","v":"EVL110DX/А/60*31ANT/ANT.U003"}]
["EVL111SX/А/60*30",{"$f":"CONCATENATE(A40,VLOOKUP($I$5,'Цвет мет. опор'!A:B,2,0),\"/\",VLOOKUP($J$5,'Цвет лючка'!A:B,2,0),\".\",VLOOKUP($K$5,'Цвет столешницы'!A:B,2,FALSE))","v":"EVL111SX/А/60*30ANT/ANT.U003"},null,"1600х900/700х750",null,17356]
["EVL111DX/А/60*31",{"$f":"CONCATENATE(A41,VLOOKUP($I$5,'Цвет мет. опор'!A:B,2,0),\"/\",VLOOKUP($J$5,'Цвет лючка'!A:B,2,0),\".\",VLOOKUP($K$5,'Цвет столешницы'!A:B,2,FALSE))","v":"EVL111DX/А/60*31ANT/ANT.U003"}]
["EVL127SX/А/60*30/",{"$f":"CONCATENATE(A42,VLOOKUP($I$5,'Цвет мет. опор'!A:B,2,0),\"/\",VLOOKUP($J$5,'Цвет лючка'!A:B,2,0),\".\",VLOOKUP($K$5,'Цвет столешницы'!A:B,2,FALSE))","v":"EVL127SX/А/60*30/ANT/ANT.U003"},"Стол эргономичный левый/правый на А-образном м/к 60х30, глубиной 600/1200 мм","1400*1200*750",null,31143]
["EVL127DX/А/60*30/",{"$f":"CONCATENATE(A43,VLOOKUP($I$5,'Цвет мет. опор'!A:B,2,0),\"/\",VLOOKUP($J$5,'Цвет лючка'!A:B,2,0),\".\",VLOOKUP($K$5,'Цвет столешницы'!A:B,2,FALSE))","v":"EVL127DX/А/60*30/ANT/ANT.U003"}]
["EVL128SX/А/60*30/",{"$f":"CONCATENATE(A44,VLOOKUP($I$5,'Цвет мет. опор'!A:B,2,0),\"/\",VLOOKUP($J$5,'Цвет лючка'!A:B,2,0),\".\",VLOOKUP($K$5,'Цвет столешницы'!A:B,2,FALSE))","v":"EVL128SX/А/60*30/ANT/ANT.U003"},null,"1600*1200*750",null,31393]
["EVL128DX/А/60*30/",{"$f":"CONCATENATE(A45,VLOOKUP($I$5,'Цвет мет. опор'!A:B,2,0),\"/\",VLOOKUP($J$5,'Цвет лючка'!A:B,2,0),\".\",VLOOKUP($K$5,'Цвет столешницы'!A:B,2,FALSE))","v":"EVL128DX/А/60*30/ANT/ANT.U003"}]
["EVL129SX/А/60*30/",{"$f":"CONCATENATE(A46,VLOOKUP($I$5,'Цвет мет. опор'!A:B,2,0),\"/\",VLOOKUP($J$5,'Цвет лючка'!A:B,2,0),\".\",VLOOKUP($K$5,'Цвет столешницы'!A:B,2,FALSE))","v":"EVL129SX/А/60*30/ANT/ANT.U003"},"Стол эргономичный левый/правый на А-образном м/к 60х30, глубиной 700/1200 мм","1400*1200*750",null,31060]
["EVL129DX/А/60*30/",{"$f":"CONCATENATE(A47,VLOOKUP($I$5,'Цвет мет. опор'!A:B,2,0),\"/\",VLOOKUP($J$5,'Цвет лючка'!A:B,2,0),\".\",VLOOKUP($K$5,'Цвет столешницы'!A:B,2,FALSE))","v":"EVL129DX/А/60*30/ANT/ANT.U003"}]
["EVL130SX/А/60*30/",{"$f":"CONCATENATE(A48,VLOOKUP($I$5,'Цвет мет. опор'!A:B,2,0),\"/\",VLOOKUP($J$5,'Цвет лючка'!A:B,2,0),\".\",VLOOKUP($K$5,'Цвет столешницы'!A:B,2,FALSE))","v":"EVL130SX/А/60*30/ANT/ANT.U003"},null,"1600*1200*750",null,31862]
["EVL130DX/А/60*30/",{"$f":"CONCATENATE(A49,VLOOKUP($I$5,'Цвет мет. опор'!A:B,2,0),\"/\",VLOOKUP($J$5,'Цвет лючка'!A:B,2,0),\".\",VLOOKUP($K$5,'Цвет столешницы'!A:B,2,FALSE))","v":"EVL130DX/А/60*30/ANT/ANT.U003"}]
["EVL131SX/А/60*30/",{"$f":"CONCATENATE(A50,VLOOKUP($I$5,'Цвет мет. опор'!A:B,2,0),\"/\",VLOOKUP($J$5,'Цвет лючка'!A:B,2,0),\".\",VLOOKUP($K$5,'Цвет столешницы'!A:B,2,FALSE))","v":"EVL131SX/А/60*30/ANT/ANT.U003"},"Стол эргономичный левый/правый на А-образном м/к 60х30, глубиной 800/1200 мм","1400*1200*750",null,31452]
["EVL131DX/А/60*30/",{"$f":"CONCATENATE(A51,VLOOKUP($I$5,'Цвет мет. опор'!A:B,2,0),\"/\",VLOOKUP($J$5,'Цвет лючка'!A:B,2,0),\".\",VLOOKUP($K$5,'Цвет столешницы'!A:B,2,FALSE))","v":"EVL131DX/А/60*30/ANT/ANT.U003"}]
["EVL132SX/А/60*30/",{"$f":"CONCATENATE(A52,VLOOKUP($I$5,'Цвет мет. опор'!A:B,2,0),\"/\",VLOOKUP($J$5,'Цвет лючка'!A:B,2,0),\".\",VLOOKUP($K$5,'Цвет столешницы'!A:B,2,FALSE))","v":"EVL132SX/А/60*30/ANT/ANT.U003"},null,"1600*1200*750",null,32612]
["EVL132DX/А/60*30/",{"$f":"CONCATENATE(A53,VLOOKUP($I$5,'Цвет мет. опор'!A:B,2,0),\"/\",VLOOKUP($J$5,'Цвет лючка'!A:B,2,0),\".\",VLOOKUP($K$5,'Цвет столешницы'!A:B,2,FALSE))","v":"EVL132DX/А/60*30/ANT/ANT.U003"}]
["EVL601/А/60*30/",{"$f":"CONCATENATE(A54,VLOOKUP($I$5,'Цвет мет. опор'!A:B,2,0),\"/\",VLOOKUP($J$5,'Цвет лючка'!A:B,2,0),\".\",VLOOKUP($K$5,'Цвет столешницы'!A:B,2,FALSE))","v":"EVL601/А/60*30/ANT/ANT.U003"},"Рабочая станция на А-образном м/к 60х30, глубиной 1236 мм","1200*1236*750",null,31656]
["EVL602/А/60*30/",{"$f":"CONCATENATE(A55,VLOOKUP($I$5,'Цвет мет. опор'!A:B,2,0),\"/\",VLOOKUP($J$5,'Цвет лючка'!A:B,2,0),\".\",VLOOKUP($K$5,'Цвет столешницы'!A:B,2,FALSE))","v":"EVL602/А/60*30/ANT/ANT.U003"},null,"1400*1236*750",null,32193]
["EVL603/А/60*30/",{"$f":"CONCATENATE(A56,VLOOKUP($I$5,'Цвет мет. опор'!A:B,2,0),\"/\",VLOOKUP($J$5,'Цвет лючка'!A:B,2,0),\".\",VLOOKUP($K$5,'Цвет столешницы'!A:B,2,FALSE))","v":"EVL603/А/60*30/ANT/ANT.U003"},null,"1600*1236*750",null,34363]
["EVL681/А/60*30/",{"$f":"CONCATENATE(A57,VLOOKUP($I$5,'Цвет мет. опор'!A:B,2,0),\"/\",VLOOKUP($J$5,'Цвет лючка'!A:B,2,0),\".\",VLOOKUP($K$5,'Цвет столешницы'!A:B,2,FALSE))","v":"EVL681/А/60*30/ANT/ANT.U003"},null,"1800*1236*750",null,37030]
["EVL604/А/60*30/",{"$f":"CONCATENATE(A58,VLOOKUP($I$5,'Цвет мет. опор'!A:B,2,0),\"/\",VLOOKUP($J$5,'Цвет лючка'!A:B,2,0),\".\",VLOOKUP($K$5,'Цвет столешницы'!A:B,2,FALSE))","v":"EVL604/А/60*30/ANT/ANT.U003"},"Рабочая станция на А-образном м/к 60х30 глубиной 1436","1200*1436*750",null,32606]
["EVL605/А/60*30/",{"$f":"CONCATENATE(A59,VLOOKUP($I$5,'Цвет мет. опор'!A:B,2,0),\"/\",VLOOKUP($J$5,'Цвет лючка'!A:B,2,0),\".\",VLOOKUP($K$5,'Цвет столешницы'!A:B,2,FALSE))","v":"EVL605/А/60*30/ANT/ANT.U003"},null,"1400*1436*750",null,34056]
["EVL606/А/60*30/",{"$f":"CONCATENATE(A60,VLOOKUP($I$5,'Цвет мет. опор'!A:B,2,0),\"/\",VLOOKUP($J$5,'Цвет лючка'!A:B,2,0),\".\",VLOOKUP($K$5,'Цвет столешницы'!A:B,2,FALSE))","v":"EVL606/А/60*30/ANT/ANT.U003"},null,"1600*1436*750",null,35479]
["EVL681/А/60*30/",{"$f":"CONCATENATE(A61,VLOOKUP($I$5,'Цвет мет. опор'!A:B,2,0),\"/\",VLOOKUP($J$5,'Цвет лючка'!A:B,2,0),\".\",VLOOKUP($K$5,'Цвет столешницы'!A:B,2,FALSE))","v":"EVL681/А/60*30/ANT/ANT.U003"},null,"1800*1436*750",null,38842]
["EVL607/А/60*30/",{"$f":"CONCATENATE(A62,VLOOKUP($I$5,'Цвет мет. опор'!A:B,2,0),\"/\",VLOOKUP($J$5,'Цвет лючка'!A:B,2,0),\".\",VLOOKUP($K$5,'Цвет столешницы'!A:B,2,FALSE))","v":"EVL607/А/60*30/ANT/ANT.U003"},"рабочая станция на А-образном м/к 60х30 глубиной 1636","1200*1636*750",null,34505]
["EVL608/А/60*30/",{"$f":"CONCATENATE(A63,VLOOKUP($I$5,'Цвет мет. опор'!A:B,2,0),\"/\",VLOOKUP($J$5,'Цвет лючка'!A:B,2,0),\".\",VLOOKUP($K$5,'Цвет столешницы'!A:B,2,FALSE))","v":"EVL608/А/60*30/ANT/ANT.U003"},null,"1400*1636*750",null,36448]
["EVL609/А/60*30/",{"$f":"CONCATENATE(A64,VLOOKUP($I$5,'Цвет мет. опор'!A:B,2,0),\"/\",VLOOKUP($J$5,'Цвет лючка'!A:B,2,0),\".\",VLOOKUP($K$5,'Цвет столешницы'!A:B,2,FALSE))","v":"EVL609/А/60*30/ANT/ANT.U003"},null,"1600*1636*750",null,36716]
["EVL683/А/60*30/",{"$f":"CONCATENATE(A65,VLOOKUP($I$5,'Цвет мет. опор'!A:B,2,0),\"/\",VLOOKUP($J$5,'Цвет лючка'!A:B,2,0),\".\",VLOOKUP($K$5,'Цвет столешницы'!A:B,2,FALSE))","v":"EVL683/А/60*30/ANT/ANT.U003"},null,"1800*1636*750",null,39420]
["EVL610/А/60*30/",{"$f":"CONCATENATE(A66,VLOOKUP($I$5,'Цвет мет. опор'!A:B,2,0),\"/\",VLOOKUP($J$5,'Цвет лючка'!A:B,2,0),\".\",VLOOKUP($K$5,'Цвет столешницы'!A:B,2,FALSE))","v":"EVL610/А/60*30/ANT/ANT.U003"},"Рабочая станция криволинейная на А-образном м/к 60х30 глубиной 1236/1836","1200*1836*750",null,34158]
["EVL611/А/60*30/",{"$f":"CONCATENATE(A67,VLOOKUP($I$5,'Цвет мет. опор'!A:B,2,0),\"/\",VLOOKUP($J$5,'Цвет лючка'!A:B,2,0),\".\",VLOOKUP($K$5,'Цвет столешницы'!A:B,2,FALSE))","v":"EVL611/А/60*30/ANT/ANT.U003"},null,"1400*1836*750",null,34723]
["EVL612/А/60*30/",{"$f":"CONCATENATE(A68,VLOOKUP($I$5,'Цвет мет. опор'!A:B,2,0),\"/\",VLOOKUP($J$5,'Цвет лючка'!A:B,2,0),\".\",VLOOKUP($K$5,'Цвет столешницы'!A:B,2,FALSE))","v":"EVL612/А/60*30/ANT/ANT.U003"},null,"1600*1836*750",null,36363]
["EVL613/А/60*30/",{"$f":"CONCATENATE(A69,VLOOKUP($I$5,'Цвет мет. опор'!A:B,2,0),\"/\",VLOOKUP($J$5,'Цвет лючка'!A:B,2,0),\".\",VLOOKUP($K$5,'Цвет столешницы'!A:B,2,FALSE))","v":"EVL613/А/60*30/ANT/ANT.U003"},"Рабочая станция криволинейная на \nА-образном м/к 60х30 глубиной 1436/1836","1200*1836*750",null,33733]
["EVL614/А/60*30/",{"$f":"CONCATENATE(A70,VLOOKUP($I$5,'Цвет мет. опор'!A:B,2,0),\"/\",VLOOKUP($J$5,'Цвет лючка'!A:B,2,0),\".\",VLOOKUP($K$5,'Цвет столешницы'!A:B,2,FALSE))","v":"EVL614/А/60*30/ANT/ANT.U003"},null,"1400*1836*750",null,34885]
["EVL615/А/60*30/",{"$f":"CONCATENATE(A71,VLOOKUP($I$5,'Цвет мет. опор'!A:B,2,0),\"/\",VLOOKUP($J$5,'Цвет лючка'!A:B,2,0),\".\",VLOOKUP($K$5,'Цвет столешницы'!A:B,2,FALSE))","v":"EVL615/А/60*30/ANT/ANT.U003"},null,"1600*1836*750",null,35957]
["EVL616/А/60*30/",{"$f":"CONCATENATE(A72,VLOOKUP($I$5,'Цвет мет. опор'!A:B,2,0),\"/\",VLOOKUP($J$5,'Цвет лючка'!A:B,2,0),\".\",VLOOKUP($K$5,'Цвет столешницы'!A:B,2,FALSE))","v":"EVL616/А/60*30/ANT/ANT.U003"},"Рабочая станция эргономичная на \nА-образном м/к 60х30 глубиной 1236/2436","1400*2436*750",null,55968]
["EVL617/А/60*30/",{"$f":"CONCATENATE(A73,VLOOKUP($I$5,'Цвет мет. опор'!A:B,2,0),\"/\",VLOOKUP($J$5,'Цвет лючка'!A:B,2,0),\".\",VLOOKUP($K$5,'Цвет столешницы'!A:B,2,FALSE))","v":"EVL617/А/60*30/ANT/ANT.U003"},null,"1600*2436*750",null,57587]
["EVL618/А/60*30/",{"$f":"CONCATENATE(A74,VLOOKUP($I$5,'Цвет мет. опор'!A:B,2,0),\"/\",VLOOKUP($J$5,'Цвет лючка'!A:B,2,0),\".\",VLOOKUP($K$5,'Цвет столешницы'!A:B,2,FALSE))","v":"EVL618/А/60*30/ANT/ANT.U003"},"Рабочая станция эргономичная на \nА-образном м/к 60х30 глубиной 1436/2436","1400*2440*750",null,56998]
["EVL619/А/60*30/",{"$f":"CONCATENATE(A75,VLOOKUP($I$5,'Цвет мет. опор'!A:B,2,0),\"/\",VLOOKUP($J$5,'Цвет лючка'!A:B,2,0),\".\",VLOOKUP($K$5,'Цвет столешницы'!A:B,2,FALSE))","v":"EVL619/А/60*30/ANT/ANT.U003"},null,"1600*2440*750",null,59369]
["EVL620/А/60*30/",{"$f":"CONCATENATE(A76,VLOOKUP($I$5,'Цвет мет. опор'!A:B,2,0),\"/\",VLOOKUP($J$5,'Цвет лючка'!A:B,2,0),\".\",VLOOKUP($K$5,'Цвет столешницы'!A:B,2,FALSE))","v":"EVL620/А/60*30/ANT/ANT.U003"},"Рабочая станция эргономичная на \nА-образном м/к 60х30 глубиной 1636/2436","1400*2440*750",null,57640]
["EVL621/А/60*30/",{"$f":"CONCATENATE(A77,VLOOKUP($I$5,'Цвет мет. опор'!A:B,2,0),\"/\",VLOOKUP($J$5,'Цвет лючка'!A:B,2,0),\".\",VLOOKUP($K$5,'Цвет столешницы'!A:B,2,FALSE))","v":"EVL621/А/60*30/ANT/ANT.U003"},null,"1600*2440*750",null,59094]
["EVL622/А/60*30/",{"$f":"CONCATENATE(A78,VLOOKUP($I$5,'Цвет мет. опор'!A:B,2,0),\"/\",VLOOKUP($J$5,'Цвет лючка'!A:B,2,0),\".\",VLOOKUP($K$5,'Цвет столешницы'!A:B,2,FALSE))","v":"EVL622/А/60*30/ANT/ANT.U003"},"Рабочая станция эргономичная на \nА-образном м/к 60х30 \nглубиной 600/900","2400*900*750",null,37222]
["EVL623/А/60*30/",{"$f":"CONCATENATE(A79,VLOOKUP($I$5,'Цвет мет. опор'!A:B,2,0),\"/\",VLOOKUP($J$5,'Цвет лючка'!A:B,2,0),\".\",VLOOKUP($K$5,'Цвет столешницы'!A:B,2,FALSE))","v":"EVL623/А/60*30/ANT/ANT.U003"},null,"2800*900*750",null,39285]
["EVL624/А/60*30/",{"$f":"CONCATENATE(A80,VLOOKUP($I$5,'Цвет мет. опор'!A:B,2,0),\"/\",VLOOKUP($J$5,'Цвет лючка'!A:B,2,0),\".\",VLOOKUP($K$5,'Цвет столешницы'!A:B,2,FALSE))","v":"EVL624/А/60*30/ANT/ANT.U003"},null,"3200*900*750",null,40526]
["EVL625/А/60*30/",{"$f":"CONCATENATE(A81,VLOOKUP($I$5,'Цвет мет. опор'!A:B,2,0),\"/\",VLOOKUP($J$5,'Цвет лючка'!A:B,2,0),\".\",VLOOKUP($K$5,'Цвет столешницы'!A:B,2,FALSE))","v":"EVL625/А/60*30/ANT/ANT.U003"},"Рабочая станция эргономичная на \nА-образном м/к 60х30 \nглубиной 700/900","2400*900*750",null,36456]
["EVL626/А/60*30/",{"$f":"CONCATENATE(A82,VLOOKUP($I$5,'Цвет мет. опор'!A:B,2,0),\"/\",VLOOKUP($J$5,'Цвет лючка'!A:B,2,0),\".\",VLOOKUP($K$5,'Цвет столешницы'!A:B,2,FALSE))","v":"EVL626/А/60*30/ANT/ANT.U003"},null,"2800*900*750",null,38377]
["EVL627/А/60*30/",{"$f":"CONCATENATE(A83,VLOOKUP($I$5,'Цвет мет. опор'!A:B,2,0),\"/\",VLOOKUP($J$5,'Цвет лючка'!A:B,2,0),\".\",VLOOKUP($K$5,'Цвет столешницы'!A:B,2,FALSE))","v":"EVL627/А/60*30/ANT/ANT.U003"},null,"3200*900*750",null,40005]
["EVL628/А/60*30/",{"$f":"CONCATENATE(A84,VLOOKUP($I$5,'Цвет мет. опор'!A:B,2,0),\"/\",VLOOKUP($J$5,'Цвет лючка'!A:B,2,0),\".\",VLOOKUP($K$5,'Цвет столешницы'!A:B,2,FALSE))","v":"EVL628/А/60*30/ANT/ANT.U003"},"Рабочая станция эргономичная на \nА-образном м/к 60х30 \nглубиной 800/900","2400*900*750",null,38049]
["EVL629/А/60*30/",{"$f":"CONCATENATE(A85,VLOOKUP($I$5,'Цвет мет. опор'!A:B,2,0),\"/\",VLOOKUP($J$5,'Цвет лючка'!A:B,2,0),\".\",VLOOKUP($K$5,'Цвет столешницы'!A:B,2,FALSE))","v":"EVL629/А/60*30/ANT/ANT.U003"},null,"2800*900*750",null,40066]
["EVL630/А/60*30/",{"$f":"CONCATENATE(A86,VLOOKUP($I$5,'Цвет мет. опор'!A:B,2,0),\"/\",VLOOKUP($J$5,'Цвет лючка'!A:B,2,0),\".\",VLOOKUP($K$5,'Цвет столешницы'!A:B,2,FALSE))","v":"EVL630/А/60*30/ANT/ANT.U003"},null,"3200*900*750",null,41280]
["EVL631/А/60*30/",{"$f":"CONCATENATE(A87,VLOOKUP($I$5,'Цвет мет. опор'!A:B,2,0),\"/\",VLOOKUP($J$5,'Цвет лючка'!A:B,2,0),\".\",VLOOKUP($K$5,'Цвет столешницы'!A:B,2,FALSE))","v":"EVL631/А/60*30/ANT/ANT.U003"},"Рабочая станция эргономичная на \nА-образном м/к 60х30 \nглубиной 600/1200","2400*1236*750","промежуточная опора 1236",41944]
["EVL632/А/60*30/",{"$f":"CONCATENATE(A88,VLOOKUP($I$5,'Цвет мет. опор'!A:B,2,0),\"/\",VLOOKUP($J$5,'Цвет лючка'!A:B,2,0),\".\",VLOOKUP($K$5,'Цвет столешницы'!A:B,2,FALSE))","v":"EVL632/А/60*30/ANT/ANT.U003"},null,"2800*1236*750",null,44646]
["EVL633/А/60*30/",{"$f":"CONCATENATE(A89,VLOOKUP($I$5,'Цвет мет. опор'!A:B,2,0),\"/\",VLOOKUP($J$5,'Цвет лючка'!A:B,2,0),\".\",VLOOKUP($K$5,'Цвет столешницы'!A:B,2,FALSE))","v":"EVL633/А/60*30/ANT/ANT.U003"},null,"3200*1236*750",null,45726]
["EVL634/А/60*30/",{"$f":"CONCATENATE(A90,VLOOKUP($I$5,'Цвет мет. опор'!A:B,2,0),\"/\",VLOOKUP($J$5,'Цвет лючка'!A:B,2,0),\".\",VLOOKUP($K$5,'Цвет столешницы'!A:B,2,FALSE))","v":"EVL634/А/60*30/ANT/ANT.U003"},"Рабочая станция эргономичная на \nА-образном м/к 60х30 \nглубиной 700/1200","2400*1200*750","промежуточная опора 700",40440]
["EVL635/А/60*30/",{"$f":"CONCATENATE(A91,VLOOKUP($I$5,'Цвет мет. опор'!A:B,2,0),\"/\",VLOOKUP($J$5,'Цвет лючка'!A:B,2,0),\".\",VLOOKUP($K$5,'Цвет столешницы'!A:B,2,FALSE))","v":"EVL635/А/60*30/ANT/ANT.U003"},null,"2800*1200*750",null,42911]
["EVL636/А/60*30/",{"$f":"CONCATENATE(A92,VLOOKUP($I$5,'Цвет мет. опор'!A:B,2,0),\"/\",VLOOKUP($J$5,'Цвет лючка'!A:B,2,0),\".\",VLOOKUP($K$5,'Цвет столешницы'!A:B,2,FALSE))","v":"EVL636/А/60*30/ANT/ANT.U003"},null,"3200*1200*750",null,44585]
["EVL637/А/60*30/",{"$f":"CONCATENATE(A93,VLOOKUP($I$5,'Цвет мет. опор'!A:B,2,0),\"/\",VLOOKUP($J$5,'Цвет лючка'!A:B,2,0),\".\",VLOOKUP($K$5,'Цвет столешницы'!A:B,2,FALSE))","v":"EVL637/А/60*30/ANT/ANT.U003"},"Рабочая станция эргономичная на \nА-образном м/к 60х30 \nглубиной 800/1200","2400*1200*750","промежуточная опора 800",40670]
["EVL638/А/60*30/",{"$f":"CONCATENATE(A94,VLOOKUP($I$5,'Цвет мет. опор'!A:B,2,0),\"/\",VLOOKUP($J$5,'Цвет лючка'!A:B,2,0),\".\",VLOOKUP($K$5,'Цвет столешницы'!A:B,2,FALSE))","v":"EVL638/А/60*30/ANT/ANT.U003"},null,"2800*1200*750",null,43273]
["EVL639/А/60*30/",{"$f":"CONCATENATE(A95,VLOOKUP($I$5,'Цвет мет. опор'!A:B,2,0),\"/\",VLOOKUP($J$5,'Цвет лючка'!A:B,2,0),\".\",VLOOKUP($K$5,'Цвет столешницы'!A:B,2,FALSE))","v":"EVL639/А/60*30/ANT/ANT.U003"},null,"3200*1200*750",null,44727]
["EVL701/А/60*30/",{"$f":"CONCATENATE(A96,VLOOKUP($I$5,'Цвет мет. опор'!A:B,2,0),\"/\",VLOOKUP($J$5,'Цвет лючка'!A:B,2,0),\".\",VLOOKUP($K$5,'Цвет столешницы'!A:B,2,FALSE))","v":"EVL701/А/60*30/ANT/ANT.U003"},"Рабочая станция на А-образном м/к 60х30 с тумбой \n(композиция стол+тумба)","1450*700*750","Тумба 450х700х750",33683]
["EVL702/А/60*30/",{"$f":"CONCATENATE(A97,VLOOKUP($I$5,'Цвет мет. опор'!A:B,2,0),\"/\",VLOOKUP($J$5,'Цвет лючка'!A:B,2,0),\".\",VLOOKUP($K$5,'Цвет столешницы'!A:B,2,FALSE))","v":"EVL702/А/60*30/ANT/ANT.U003"},null,"1650*700*750",null,34321]
["EVL703/А/60*30/",{"$f":"CONCATENATE(A98,VLOOKUP($I$5,'Цвет мет. опор'!A:B,2,0),\"/\",VLOOKUP($J$5,'Цвет лючка'!A:B,2,0),\".\",VLOOKUP($K$5,'Цвет столешницы'!A:B,2,FALSE))","v":"EVL703/А/60*30/ANT/ANT.U003"},null,"1850*700*750",null,35050]
["EVL704/А/60*30/",{"$f":"CONCATENATE(A99,VLOOKUP($I$5,'Цвет мет. опор'!A:B,2,0),\"/\",VLOOKUP($J$5,'Цвет лючка'!A:B,2,0),\".\",VLOOKUP($K$5,'Цвет столешницы'!A:B,2,FALSE))","v":"EVL704/А/60*30/ANT/ANT.U003"},null,"2050*700*750",null,36012]
["EVL705/А/60*30/",{"$f":"CONCATENATE(A100,VLOOKUP($I$5,'Цвет мет. опор'!A:B,2,0),\"/\",VLOOKUP($J$5,'Цвет лючка'!A:B,2,0),\".\",VLOOKUP($K$5,'Цвет столешницы'!A:B,2,FALSE))","v":"EVL705/А/60*30/ANT/ANT.U003"},null,"2250*700*750",null,36693]
["EVL706/А/60*30/",{"$f":"CONCATENATE(A101,VLOOKUP($I$5,'Цвет мет. опор'!A:B,2,0),\"/\",VLOOKUP($J$5,'Цвет лючка'!A:B,2,0),\".\",VLOOKUP($K$5,'Цвет столешницы'!A:B,2,FALSE))","v":"EVL706/А/60*30/ANT/ANT.U003"},"Рабочая станция на А-образном м/к 60х30 с тумбой \n(композиция двойной бенч+тумба)","1450*1436*750","Тумба  450х1436х750",57951]
["EVL707/А/60*30/",{"$f":"CONCATENATE(A102,VLOOKUP($I$5,'Цвет мет. опор'!A:B,2,0),\"/\",VLOOKUP($J$5,'Цвет лючка'!A:B,2,0),\".\",VLOOKUP($K$5,'Цвет столешницы'!A:B,2,FALSE))","v":"EVL707/А/60*30/ANT/ANT.U003"},null,"1650*1436*750",null,59167]
["EVL708/А/60*30/",{"$f":"CONCATENATE(A103,VLOOKUP($I$5,'Цвет мет. опор'!A:B,2,0),\"/\",VLOOKUP($J$5,'Цвет лючка'!A:B,2,0),\".\",VLOOKUP($K$5,'Цвет столешницы'!A:B,2,FALSE))","v":"EVL708/А/60*30/ANT/ANT.U003"},null,"1850*1436*750",null,60617]
["EVL709/А/60*30/",{"$f":"CONCATENATE(A104,VLOOKUP($I$5,'Цвет мет. опор'!A:B,2,0),\"/\",VLOOKUP($J$5,'Цвет лючка'!A:B,2,0),\".\",VLOOKUP($K$5,'Цвет столешницы'!A:B,2,FALSE))","v":"EVL709/А/60*30/ANT/ANT.U003"},null,"2050*1436*750",null,62040]
["EVL710/А/60*30/",{"$f":"CONCATENATE(A105,VLOOKUP($I$5,'Цвет мет. опор'!A:B,2,0),\"/\",VLOOKUP($J$5,'Цвет лючка'!A:B,2,0),\".\",VLOOKUP($K$5,'Цвет столешницы'!A:B,2,FALSE))","v":"EVL710/А/60*30/ANT/ANT.U003"},null,"2250*1436*750",null,63675]
["EVL711/А/60*30/",{"$f":"CONCATENATE(A106,VLOOKUP($I$5,'Цвет мет. опор'!A:B,2,0),\"/\",VLOOKUP($J$5,'Цвет лючка'!A:B,2,0),\".\",VLOOKUP($K$5,'Цвет столешницы'!A:B,2,FALSE))","v":"EVL711/А/60*30/ANT/ANT.U003"},"Рабочая станция на А-образном м/к 60х30 со шкафом-купе\n(композиция двойной бенч+шкаф-купе)","1410*1436*750","Шкаф-купе приставной\n1440х410х750",51855]
["EVL712/А/60*30/",{"$f":"CONCATENATE(A107,VLOOKUP($I$5,'Цвет мет. опор'!A:B,2,0),\"/\",VLOOKUP($J$5,'Цвет лючка'!A:B,2,0),\".\",VLOOKUP($K$5,'Цвет столешницы'!A:B,2,FALSE))","v":"EVL712/А/60*30/ANT/ANT.U003"},null,"1610*1436*750",null,53071]
["EVL713/А/60*30/",{"$f":"CONCATENATE(A108,VLOOKUP($I$5,'Цвет мет. опор'!A:B,2,0),\"/\",VLOOKUP($J$5,'Цвет лючка'!A:B,2,0),\".\",VLOOKUP($K$5,'Цвет столешницы'!A:B,2,FALSE))","v":"EVL713/А/60*30/ANT/ANT.U003"},null,"1810*1436*750",null,54520]
["EVL714/А/60*30/",{"$f":"CONCATENATE(A109,VLOOKUP($I$5,'Цвет мет. опор'!A:B,2,0),\"/\",VLOOKUP($J$5,'Цвет лючка'!A:B,2,0),\".\",VLOOKUP($K$5,'Цвет столешницы'!A:B,2,FALSE))","v":"EVL714/А/60*30/ANT/ANT.U003"},null,"2010*1436*750",null,55944]
["EVL715/А/60*30/",{"$f":"CONCATENATE(A110,VLOOKUP($I$5,'Цвет мет. опор'!A:B,2,0),\"/\",VLOOKUP($J$5,'Цвет лючка'!A:B,2,0),\".\",VLOOKUP($K$5,'Цвет столешницы'!A:B,2,FALSE))","v":"EVL715/А/60*30/ANT/ANT.U003"},null,"2210*1436*750",null,57874]
["EVL716/А/60*30/",{"$f":"CONCATENATE(A111,VLOOKUP($I$5,'Цвет мет. опор'!A:B,2,0),\"/\",VLOOKUP($J$5,'Цвет лючка'!A:B,2,0),\".\",VLOOKUP($K$5,'Цвет столешницы'!A:B,2,FALSE))","v":"EVL716/А/60*30/ANT/ANT.U003"},"Рабочая станция на А-образном м/к 60х30 со шкафом-купе\n(композиция двойной бенч+шкаф-купе)","1410*1436*1098","Шкаф-купе приставной  1440х410х1098",56422]
["EVL717/А/60*30/",{"$f":"CONCATENATE(A112,VLOOKUP($I$5,'Цвет мет. опор'!A:B,2,0),\"/\",VLOOKUP($J$5,'Цвет лючка'!A:B,2,0),\".\",VLOOKUP($K$5,'Цвет столешницы'!A:B,2,FALSE))","v":"EVL717/А/60*30/ANT/ANT.U003"},null,"1610*1436*1098",null,57933]
["EVL718/А/60*30/",{"$f":"CONCATENATE(A113,VLOOKUP($I$5,'Цвет мет. опор'!A:B,2,0),\"/\",VLOOKUP($J$5,'Цвет лючка'!A:B,2,0),\".\",VLOOKUP($K$5,'Цвет столешницы'!A:B,2,FALSE))","v":"EVL718/А/60*30/ANT/ANT.U003"},null,"1810*1436*1098",null,59382]
["EVL719/А/60*30/",{"$f":"CONCATENATE(A114,VLOOKUP($I$5,'Цвет мет. опор'!A:B,2,0),\"/\",VLOOKUP($J$5,'Цвет лючка'!A:B,2,0),\".\",VLOOKUP($K$5,'Цвет столешницы'!A:B,2,FALSE))","v":"EVL719/А/60*30/ANT/ANT.U003"},null,"2010*1436*1098",null,60806]
["EVL720/А/60*30/",{"$f":"CONCATENATE(A115,VLOOKUP($I$5,'Цвет мет. опор'!A:B,2,0),\"/\",VLOOKUP($J$5,'Цвет лючка'!A:B,2,0),\".\",VLOOKUP($K$5,'Цвет столешницы'!A:B,2,FALSE))","v":"EVL720/А/60*30/ANT/ANT.U003"},null,"2210*1436*1098",null,62441]
["EVL721/А/60*30/",{"$f":"CONCATENATE(A116,VLOOKUP($I$5,'Цвет мет. опор'!A:B,2,0),\"/\",VLOOKUP($J$5,'Цвет лючка'!A:B,2,0),\".\",VLOOKUP($K$5,'Цвет столешницы'!A:B,2,FALSE))","v":"EVL721/А/60*30/ANT/ANT.U003"},"Стол письменный на А-образном м/к 60х30 со шкафом-купе\n(композиция двойной бенч+шкаф-купе)","1410*1240*1098","Шкаф-купе приставной  1240х410х1098",41414]
["EVL722/А/60*30/",{"$f":"CONCATENATE(A117,VLOOKUP($I$5,'Цвет мет. опор'!A:B,2,0),\"/\",VLOOKUP($J$5,'Цвет лючка'!A:B,2,0),\".\",VLOOKUP($K$5,'Цвет столешницы'!A:B,2,FALSE))","v":"EVL722/А/60*30/ANT/ANT.U003"},null,"1610*1240*1098",null,42052]
["EVL723/А/60*30/",{"$f":"CONCATENATE(A118,VLOOKUP($I$5,'Цвет мет. опор'!A:B,2,0),\"/\",VLOOKUP($J$5,'Цвет лючка'!A:B,2,0),\".\",VLOOKUP($K$5,'Цвет столешницы'!A:B,2,FALSE))","v":"EVL723/А/60*30/ANT/ANT.U003"},null,"1810*1240*1098",null,42781]
["EVL724/А/60*30/",{"$f":"CONCATENATE(A119,VLOOKUP($I$5,'Цвет мет. опор'!A:B,2,0),\"/\",VLOOKUP($J$5,'Цвет лючка'!A:B,2,0),\".\",VLOOKUP($K$5,'Цвет столешницы'!A:B,2,FALSE))","v":"EVL724/А/60*30/ANT/ANT.U003"},null,"2010*1240*1098",null,43743]
["EVL725/А/60*30/",{"$f":"CONCATENATE(A120,VLOOKUP($I$5,'Цвет мет. опор'!A:B,2,0),\"/\",VLOOKUP($J$5,'Цвет лючка'!A:B,2,0),\".\",VLOOKUP($K$5,'Цвет столешницы'!A:B,2,FALSE))","v":"EVL725/А/60*30/ANT/ANT.U003"},null,"2210*1240*1098",null,44424]
["EVL726/А/60*30/",{"$f":"CONCATENATE(A121,VLOOKUP($I$5,'Цвет мет. опор'!A:B,2,0),\"/\",VLOOKUP($J$5,'Цвет лючка'!A:B,2,0),\".\",VLOOKUP($K$5,'Цвет столешницы'!A:B,2,FALSE))","v":"EVL726/А/60*30/ANT/ANT.U003"},"Рабочая станция на А-образном м/к 60х30 со шкафом-купе\n(композиция двойной бенч+шкаф-купе)","1410*2332*1098","Шкаф-купе приставной \n2332х410х1098",80069]
["EVL727/А/60*30/",{"$f":"CONCATENATE(A122,VLOOKUP($I$5,'Цвет мет. опор'!A:B,2,0),\"/\",VLOOKUP($J$5,'Цвет лючка'!A:B,2,0),\".\",VLOOKUP($K$5,'Цвет столешницы'!A:B,2,FALSE))","v":"EVL727/А/60*30/ANT/ANT.U003"},null,"1610*2332*1098",null,81579]
["EVL728/А/60*30/",{"$f":"CONCATENATE(A123,VLOOKUP($I$5,'Цвет мет. опор'!A:B,2,0),\"/\",VLOOKUP($J$5,'Цвет лючка'!A:B,2,0),\".\",VLOOKUP($K$5,'Цвет столешницы'!A:B,2,FALSE))","v":"EVL728/А/60*30/ANT/ANT.U003"},null,"1810*2332*1098",null,83029]
["EVL729/А/60*30/",{"$f":"CONCATENATE(A124,VLOOKUP($I$5,'Цвет мет. опор'!A:B,2,0),\"/\",VLOOKUP($J$5,'Цвет лючка'!A:B,2,0),\".\",VLOOKUP($K$5,'Цвет столешницы'!A:B,2,FALSE))","v":"EVL729/А/60*30/ANT/ANT.U003"},null,"2010*2332*1098",null,84453]
["EVL730/А/60*30/",{"$f":"CONCATENATE(A125,VLOOKUP($I$5,'Цвет мет. опор'!A:B,2,0),\"/\",VLOOKUP($J$5,'Цвет лючка'!A:B,2,0),\".\",VLOOKUP($K$5,'Цвет столешницы'!A:B,2,FALSE))","v":"EVL730/А/60*30/ANT/ANT.U003"},null,"2210*2332*1098",null,86088]
[null,null,"Бэнч-системы"]
["EVL645/А/60*30/",{"$f":"CONCATENATE(A127,VLOOKUP($I$5,'Цвет мет. опор'!A:B,2,0),\"/\",VLOOKUP($J$5,'Цвет лючка'!A:B,2,0),\".\",VLOOKUP($K$5,'Цвет столешницы'!A:B,2,FALSE))","v":"EVL645/А/60*30/ANT/ANT.U003"},"Рабочая станция на 2 раб.места на А-образном м/к 60х30 (бенч-система) глубиной 600","2400*600*750",null,34720]
["EVL646/А/60*30/",{"$f":"CONCATENATE(A128,VLOOKUP($I$5,'Цвет мет. опор'!A:B,2,0),\"/\",VLOOKUP($J$5,'Цвет лючка'!A:B,2,0),\".\",VLOOKUP($K$5,'Цвет столешницы'!A:B,2,FALSE))","v":"EVL646/А/60*30/ANT/ANT.U003"},null,"2800*600*750",null,35850]
["EVL647/А/60*30/",{"$f":"CONCATENATE(A129,VLOOKUP($I$5,'Цвет мет. опор'!A:B,2,0),\"/\",VLOOKUP($J$5,'Цвет лючка'!A:B,2,0),\".\",VLOOKUP($K$5,'Цвет столешницы'!A:B,2,FALSE))","v":"EVL647/А/60*30/ANT/ANT.U003"},null,"3200*600*750",null,37427]
["EVL648/А/60*30/",{"$f":"CONCATENATE(A130,VLOOKUP($I$5,'Цвет мет. опор'!A:B,2,0),\"/\",VLOOKUP($J$5,'Цвет лючка'!A:B,2,0),\".\",VLOOKUP($K$5,'Цвет столешницы'!A:B,2,FALSE))","v":"EVL648/А/60*30/ANT/ANT.U003"},"Рабочая станция на 2 раб.места на А-образном м/к 60х30 (бенч-система) глубиной 700","2400*700*750",null,36404]
["EVL649/А/60*30/",{"$f":"CONCATENATE(A131,VLOOKUP($I$5,'Цвет мет. опор'!A:B,2,0),\"/\",VLOOKUP($J$5,'Цвет лючка'!A:B,2,0),\".\",VLOOKUP($K$5,'Цвет столешницы'!A:B,2,FALSE))","v":"EVL649/А/60*30/ANT/ANT.U003"},null,"2800*700*750",null,38102]
["EVL650/А/60*30/",{"$f":"CONCATENATE(A132,VLOOKUP($I$5,'Цвет мет. опор'!A:B,2,0),\"/\",VLOOKUP($J$5,'Цвет лючка'!A:B,2,0),\".\",VLOOKUP($K$5,'Цвет столешницы'!A:B,2,FALSE))","v":"EVL650/А/60*30/ANT/ANT.U003"},null,"3200*700*750",null,39205]
["EVL651/А/60*30/",{"$f":"CONCATENATE(A133,VLOOKUP($I$5,'Цвет мет. опор'!A:B,2,0),\"/\",VLOOKUP($J$5,'Цвет лючка'!A:B,2,0),\".\",VLOOKUP($K$5,'Цвет столешницы'!A:B,2,FALSE))","v":"EVL651/А/60*30/ANT/ANT.U003"},"Рабочая станция на 2 раб.места на А-образном м/к 60х30 (бенч-система) глубиной 800","2400*800*750",null,37095]
["EVL652/А/60*30/",{"$f":"CONCATENATE(A134,VLOOKUP($I$5,'Цвет мет. опор'!A:B,2,0),\"/\",VLOOKUP($J$5,'Цвет лючка'!A:B,2,0),\".\",VLOOKUP($K$5,'Цвет столешницы'!A:B,2,FALSE))","v":"EVL652/А/60*30/ANT/ANT.U003"},null,"2800*800*750",null,38145]
["EVL653/А/60*30/",{"$f":"CONCATENATE(A135,VLOOKUP($I$5,'Цвет мет. опор'!A:B,2,0),\"/\",VLOOKUP($J$5,'Цвет лючка'!A:B,2,0),\".\",VLOOKUP($K$5,'Цвет столешницы'!A:B,2,FALSE))","v":"EVL653/А/60*30/ANT/ANT.U003"},null,"3200*800*750",null,40368]
["EVL654/А/60*30/",{"$f":"CONCATENATE(A136,VLOOKUP($I$5,'Цвет мет. опор'!A:B,2,0),\"/\",VLOOKUP($J$5,'Цвет лючка'!A:B,2,0),\".\",VLOOKUP($K$5,'Цвет столешницы'!A:B,2,FALSE))","v":"EVL654/А/60*30/ANT/ANT.U003"},"Рабочая станция на 3 раб.места на А-образном м/к 60х30 (бенч-система), глубиной 600 мм","3600*600*750",null,52943]
["EVL655/А/60*30/",{"$f":"CONCATENATE(A137,VLOOKUP($I$5,'Цвет мет. опор'!A:B,2,0),\"/\",VLOOKUP($J$5,'Цвет лючка'!A:B,2,0),\".\",VLOOKUP($K$5,'Цвет столешницы'!A:B,2,FALSE))","v":"EVL655/А/60*30/ANT/ANT.U003"},null,"4200*600*750",null,55491]
["EVL656/А/60*30/",{"$f":"CONCATENATE(A138,VLOOKUP($I$5,'Цвет мет. опор'!A:B,2,0),\"/\",VLOOKUP($J$5,'Цвет лючка'!A:B,2,0),\".\",VLOOKUP($K$5,'Цвет столешницы'!A:B,2,FALSE))","v":"EVL656/А/60*30/ANT/ANT.U003"},null,"4800*600*750",null,57144]
["EVL657/А/60*30/",{"$f":"CONCATENATE(A139,VLOOKUP($I$5,'Цвет мет. опор'!A:B,2,0),\"/\",VLOOKUP($J$5,'Цвет лючка'!A:B,2,0),\".\",VLOOKUP($K$5,'Цвет столешницы'!A:B,2,FALSE))","v":"EVL657/А/60*30/ANT/ANT.U003"},"Рабочая станция на 3 раб.места на А-образном м/к 60х30 (бенч-система), глубиной 700 мм","3600*700*750",null,53481]
["EVL658/А/60*30/",{"$f":"CONCATENATE(A140,VLOOKUP($I$5,'Цвет мет. опор'!A:B,2,0),\"/\",VLOOKUP($J$5,'Цвет лючка'!A:B,2,0),\".\",VLOOKUP($K$5,'Цвет столешницы'!A:B,2,FALSE))","v":"EVL658/А/60*30/ANT/ANT.U003"},null,"4200*700*750",null,56028]
["EVL659/А/60*30/",{"$f":"CONCATENATE(A141,VLOOKUP($I$5,'Цвет мет. опор'!A:B,2,0),\"/\",VLOOKUP($J$5,'Цвет лючка'!A:B,2,0),\".\",VLOOKUP($K$5,'Цвет столешницы'!A:B,2,FALSE))","v":"EVL659/А/60*30/ANT/ANT.U003"},null,"4800*700*750",null,57682]
["EVL660/А/60*30/",{"$f":"CONCATENATE(A142,VLOOKUP($I$5,'Цвет мет. опор'!A:B,2,0),\"/\",VLOOKUP($J$5,'Цвет лючка'!A:B,2,0),\".\",VLOOKUP($K$5,'Цвет столешницы'!A:B,2,FALSE))","v":"EVL660/А/60*30/ANT/ANT.U003"},"Рабочая станция на 3 раб.места на А-образном м/к 60х30 (бенч-система), глубиной 800 мм","3600*800*750",null,53482]
["EVL661/А/60*30/",{"$f":"CONCATENATE(A143,VLOOKUP($I$5,'Цвет мет. опор'!A:B,2,0),\"/\",VLOOKUP($J$5,'Цвет лючка'!A:B,2,0),\".\",VLOOKUP($K$5,'Цвет столешницы'!A:B,2,FALSE))","v":"EVL661/А/60*30/ANT/ANT.U003"},null,"4200*800*750",null,55880]
["EVL662/А/60*30/",{"$f":"CONCATENATE(A144,VLOOKUP($I$5,'Цвет мет. опор'!A:B,2,0),\"/\",VLOOKUP($J$5,'Цвет лючка'!A:B,2,0),\".\",VLOOKUP($K$5,'Цвет столешницы'!A:B,2,FALSE))","v":"EVL662/А/60*30/ANT/ANT.U003"},null,"4800*800*750",null,57683]
["EVL663/А/60*30/",{"$f":"CONCATENATE(A145,VLOOKUP($I$5,'Цвет мет. опор'!A:B,2,0),\"/\",VLOOKUP($J$5,'Цвет лючка'!A:B,2,0),\".\",VLOOKUP($K$5,'Цвет столешницы'!A:B,2,FALSE))","v":"EVL663/А/60*30/ANT/ANT.U003"},"Рабочая станция на 4 раб.места на А-образном м/к 60х30 с шириной 1-го рабочего места 600 мм ","2400*1236*750",null,60397]
["EVL664/А/60*30/",{"$f":"CONCATENATE(A146,VLOOKUP($I$5,'Цвет мет. опор'!A:B,2,0),\"/\",VLOOKUP($J$5,'Цвет лючка'!A:B,2,0),\".\",VLOOKUP($K$5,'Цвет столешницы'!A:B,2,FALSE))","v":"EVL664/А/60*30/ANT/ANT.U003"},null,"2800*1236*750",null,62656]
["EVL665/А/60*30/",{"$f":"CONCATENATE(A147,VLOOKUP($I$5,'Цвет мет. опор'!A:B,2,0),\"/\",VLOOKUP($J$5,'Цвет лючка'!A:B,2,0),\".\",VLOOKUP($K$5,'Цвет столешницы'!A:B,2,FALSE))","v":"EVL665/А/60*30/ANT/ANT.U003"},null,"3200*1236*750",null,65811]
["EVL666/А/60*30/",{"$f":"CONCATENATE(A148,VLOOKUP($I$5,'Цвет мет. опор'!A:B,2,0),\"/\",VLOOKUP($J$5,'Цвет лючка'!A:B,2,0),\".\",VLOOKUP($K$5,'Цвет столешницы'!A:B,2,FALSE))","v":"EVL666/А/60*30/ANT/ANT.U003"},"Рабочая станция на 4 раб.места на А-образном м/к 60х30 с шириной 1-го рабочего места 700 мм","2400*1436*750",null,63228]
["EVL667/А/60*30/",{"$f":"CONCATENATE(A149,VLOOKUP($I$5,'Цвет мет. опор'!A:B,2,0),\"/\",VLOOKUP($J$5,'Цвет лючка'!A:B,2,0),\".\",VLOOKUP($K$5,'Цвет столешницы'!A:B,2,FALSE))","v":"EVL667/А/60*30/ANT/ANT.U003"},null,"2800*1436*750",null,66625]
["EVL668/А/60*30/",{"$f":"CONCATENATE(A150,VLOOKUP($I$5,'Цвет мет. опор'!A:B,2,0),\"/\",VLOOKUP($J$5,'Цвет лючка'!A:B,2,0),\".\",VLOOKUP($K$5,'Цвет столешницы'!A:B,2,FALSE))","v":"EVL668/А/60*30/ANT/ANT.U003"},null,"3200*1436*750",null,66884]
["EVL669/А/60*30/",{"$f":"CONCATENATE(A151,VLOOKUP($I$5,'Цвет мет. опор'!A:B,2,0),\"/\",VLOOKUP($J$5,'Цвет лючка'!A:B,2,0),\".\",VLOOKUP($K$5,'Цвет столешницы'!A:B,2,FALSE))","v":"EVL669/А/60*30/ANT/ANT.U003"},"Рабочая станция на 4 раб.места на А-образном м/к 60х30 с шириной 1-го рабочего места 800 мм","2400*1636*750",null,65584]
["EVL670/А/60*30/",{"$f":"CONCATENATE(A152,VLOOKUP($I$5,'Цвет мет. опор'!A:B,2,0),\"/\",VLOOKUP($J$5,'Цвет лючка'!A:B,2,0),\".\",VLOOKUP($K$5,'Цвет столешницы'!A:B,2,FALSE))","v":"EVL670/А/60*30/ANT/ANT.U003"},null,"2800*1636*750",null,67676]
["EVL671/А/60*30/",{"$f":"CONCATENATE(A153,VLOOKUP($I$5,'Цвет мет. опор'!A:B,2,0),\"/\",VLOOKUP($J$5,'Цвет лючка'!A:B,2,0),\".\",VLOOKUP($K$5,'Цвет столешницы'!A:B,2,FALSE))","v":"EVL671/А/60*30/ANT/ANT.U003"},null,"3200*1636*750",null,70013]
["EVL672/А/60*30/",{"$f":"CONCATENATE(A154,VLOOKUP($I$5,'Цвет мет. опор'!A:B,2,0),\"/\",VLOOKUP($J$5,'Цвет лючка'!A:B,2,0),\".\",VLOOKUP($K$5,'Цвет столешницы'!A:B,2,FALSE))","v":"EVL672/А/60*30/ANT/ANT.U003"},"Рабочая станция на 6 раб.места на А образном м/к 60х30 с шириной 1-го рабочего места 600 мм","3600*1236*750",null,89137]
["EVL673/А/60*30/",{"$f":"CONCATENATE(A155,VLOOKUP($I$5,'Цвет мет. опор'!A:B,2,0),\"/\",VLOOKUP($J$5,'Цвет лючка'!A:B,2,0),\".\",VLOOKUP($K$5,'Цвет столешницы'!A:B,2,FALSE))","v":"EVL673/А/60*30/ANT/ANT.U003"},null,"4200*1236*750",null,92527]
["EVL674/А/60*30/",{"$f":"CONCATENATE(A156,VLOOKUP($I$5,'Цвет мет. опор'!A:B,2,0),\"/\",VLOOKUP($J$5,'Цвет лючка'!A:B,2,0),\".\",VLOOKUP($K$5,'Цвет столешницы'!A:B,2,FALSE))","v":"EVL674/А/60*30/ANT/ANT.U003"},null,"4800*1236*750",null,97258]
["EVL675/А/60*30/",{"$f":"CONCATENATE(A157,VLOOKUP($I$5,'Цвет мет. опор'!A:B,2,0),\"/\",VLOOKUP($J$5,'Цвет лючка'!A:B,2,0),\".\",VLOOKUP($K$5,'Цвет столешницы'!A:B,2,FALSE))","v":"EVL675/А/60*30/ANT/ANT.U003"},"Рабочая станция на 6 раб.места на А образном м/к 60х30 с шириной 1-го рабочего места 700 мм","3600*1436*750",null,91994]
["EVL676/А/60*30/",{"$f":"CONCATENATE(A158,VLOOKUP($I$5,'Цвет мет. опор'!A:B,2,0),\"/\",VLOOKUP($J$5,'Цвет лючка'!A:B,2,0),\".\",VLOOKUP($K$5,'Цвет столешницы'!A:B,2,FALSE))","v":"EVL676/А/60*30/ANT/ANT.U003"},null,"4200*1436*750",null,96164]
["EVL677/А/60*30/",{"$f":"CONCATENATE(A159,VLOOKUP($I$5,'Цвет мет. опор'!A:B,2,0),\"/\",VLOOKUP($J$5,'Цвет лючка'!A:B,2,0),\".\",VLOOKUP($K$5,'Цвет столешницы'!A:B,2,FALSE))","v":"EVL677/А/60*30/ANT/ANT.U003"},null,"4800*1436*750",null,101744]
["EVL678/А/60*30/",{"$f":"CONCATENATE(A160,VLOOKUP($I$5,'Цвет мет. опор'!A:B,2,0),\"/\",VLOOKUP($J$5,'Цвет лючка'!A:B,2,0),\".\",VLOOKUP($K$5,'Цвет столешницы'!A:B,2,FALSE))","v":"EVL678/А/60*30/ANT/ANT.U003"},"Рабочая станция на 6 раб.места на А образном м/к 60х30 с шириной 1-го рабочего места 800 мм","3600*1636*750",null,96664]
["EVL679/А/60*30/",{"$f":"CONCATENATE(A161,VLOOKUP($I$5,'Цвет мет. опор'!A:B,2,0),\"/\",VLOOKUP($J$5,'Цвет лючка'!A:B,2,0),\".\",VLOOKUP($K$5,'Цвет столешницы'!A:B,2,FALSE))","v":"EVL679/А/60*30/ANT/ANT.U003"},null,"4200*1636*750",null,99805]
["EVL680/А/60*30/",{"$f":"CONCATENATE(A162,VLOOKUP($I$5,'Цвет мет. опор'!A:B,2,0),\"/\",VLOOKUP($J$5,'Цвет лючка'!A:B,2,0),\".\",VLOOKUP($K$5,'Цвет столешницы'!A:B,2,FALSE))","v":"EVL680/А/60*30/ANT/ANT.U003"},null,"4800*1636*750",null,106483]
[null,null,null,"Переговорные столы"]
["EVL800/А/60*30/",{"$f":"CONCATENATE(A164,VLOOKUP($I$5,'Цвет мет. опор'!A:B,2,0),\".\",VLOOKUP($K$5,'Цвет столешницы'!A:B,2,FALSE))","v":"EVL800/А/60*30/ANT.U003"},"Переговорный стол (1 столешница) \nна А-образном м/к 60х30","1000*1236*750",null,30456]
["EVL801/А/60*30/",{"$f":"CONCATENATE(A165,VLOOKUP($I$5,'Цвет мет. опор'!A:B,2,0),\".\",VLOOKUP($K$5,'Цвет столешницы'!A:B,2,FALSE))","v":"EVL801/А/60*30/ANT.U003"},null,"1200*1236*750",null,31692]
["EVL802/А/60*30/",{"$f":"CONCATENATE(A166,VLOOKUP($I$5,'Цвет мет. опор'!A:B,2,0),\".\",VLOOKUP($K$5,'Цвет столешницы'!A:B,2,FALSE))","v":"EVL802/А/60*30/ANT.U003"},null,"1400*1236*750",null,33345]
["EVL803/А/60*30/",{"$f":"CONCATENATE(A167,VLOOKUP($I$5,'Цвет мет. опор'!A:B,2,0),\".\",VLOOKUP($K$5,'Цвет столешницы'!A:B,2,FALSE))","v":"EVL803/А/60*30/ANT.U003"},null,"1600*1236*750",null,35064]
["EVL804/А/60*30/",{"$f":"CONCATENATE(A168,VLOOKUP($I$5,'Цвет мет. опор'!A:B,2,0),\".\",VLOOKUP($K$5,'Цвет столешницы'!A:B,2,FALSE))","v":"EVL804/А/60*30/ANT.U003"},null,"1800*1236*750",null,36958]
["EVL805/А/60*30/",{"$f":"CONCATENATE(A169,VLOOKUP($I$5,'Цвет мет. опор'!A:B,2,0),\".\",VLOOKUP($K$5,'Цвет столешницы'!A:B,2,FALSE))","v":"EVL805/А/60*30/ANT.U003"},"Переговорный стол (2 столешницы)\n на А-образном м/к 60х30","2000*1236*750",null,52462]
["EVL806/А/60*30/",{"$f":"CONCATENATE(A170,VLOOKUP($I$5,'Цвет мет. опор'!A:B,2,0),\".\",VLOOKUP($K$5,'Цвет столешницы'!A:B,2,FALSE))","v":"EVL806/А/60*30/ANT.U003"},null,"2400*1236*750",null,54555]
["EVL807/А/60*30/",{"$f":"CONCATENATE(A171,VLOOKUP($I$5,'Цвет мет. опор'!A:B,2,0),\".\",VLOOKUP($K$5,'Цвет столешницы'!A:B,2,FALSE))","v":"EVL807/А/60*30/ANT.U003"},null,"2800*1236*750",null,57048]
["EVL808/А/60*30/",{"$f":"CONCATENATE(A172,VLOOKUP($I$5,'Цвет мет. опор'!A:B,2,0),\".\",VLOOKUP($K$5,'Цвет столешницы'!A:B,2,FALSE))","v":"EVL808/А/60*30/ANT.U003"},null,"3200*1236*750",null,67211]
["EVL809/А/60*30/",{"$f":"CONCATENATE(A173,VLOOKUP($I$5,'Цвет мет. опор'!A:B,2,0),\".\",VLOOKUP($K$5,'Цвет столешницы'!A:B,2,FALSE))","v":"EVL809/А/60*30/ANT.U003"},null,"3600*1236*750",null,71000]
["EVL810/А/60*30/",{"$f":"CONCATENATE(A174,VLOOKUP($I$5,'Цвет мет. опор'!A:B,2,0),\".\",VLOOKUP($K$5,'Цвет столешницы'!A:B,2,FALSE))","v":"EVL810/А/60*30/ANT.U003"},"Переговорный стол (3 столешницы)\n на А-образном м/к 60х30","3000*1236*750",null,73461]
["EVL811/А/60*30/",{"$f":"CONCATENATE(A175,VLOOKUP($I$5,'Цвет мет. опор'!A:B,2,0),\".\",VLOOKUP($K$5,'Цвет столешницы'!A:B,2,FALSE))","v":"EVL811/А/60*30/ANT.U003"},null,"3600*1236*750",null,80374]
["EVL812/А/60*30/",{"$f":"CONCATENATE(A176,VLOOKUP($I$5,'Цвет мет. опор'!A:B,2,0),\".\",VLOOKUP($K$5,'Цвет столешницы'!A:B,2,FALSE))","v":"EVL812/А/60*30/ANT.U003"},null,"4200*1236*750",null,84114]
["EVL813/А/60*30/",{"$f":"CONCATENATE(A177,VLOOKUP($I$5,'Цвет мет. опор'!A:B,2,0),\".\",VLOOKUP($K$5,'Цвет столешницы'!A:B,2,FALSE))","v":"EVL813/А/60*30/ANT.U003"},null,"4800*1236*750",null,86546]
["EVL814/А/60*30/",{"$f":"CONCATENATE(A178,VLOOKUP($I$5,'Цвет мет. опор'!A:B,2,0),\".\",VLOOKUP($K$5,'Цвет столешницы'!A:B,2,FALSE))","v":"EVL814/А/60*30/ANT.U003"},null,"5400*1236*750",null,89641]
["EVL841/А/60*30/",{"$f":"CONCATENATE(A179,VLOOKUP($I$5,'Цвет мет. опор'!A:B,2,0),\".\",VLOOKUP($K$5,'Цвет столешницы'!A:B,2,FALSE))","v":"EVL841/А/60*30/ANT.U003"},"Переговорный стол (3 столешницы)\n на А-образном м/к 60х30","3600*1436*750",null,82796]
["EVL842/А/60*30/",{"$f":"CONCATENATE(A180,VLOOKUP($I$5,'Цвет мет. опор'!A:B,2,0),\".\",VLOOKUP($K$5,'Цвет столешницы'!A:B,2,FALSE))","v":"EVL842/А/60*30/ANT.U003"},null,"4200*1436*750",null,86644]
["EVL843/А/60*30/",{"$f":"CONCATENATE(A181,VLOOKUP($I$5,'Цвет мет. опор'!A:B,2,0),\".\",VLOOKUP($K$5,'Цвет столешницы'!A:B,2,FALSE))","v":"EVL843/А/60*30/ANT.U003"},null,"4800*1436*750",null,89175]
["EVL844/А/60*30/",{"$f":"CONCATENATE(A182,VLOOKUP($I$5,'Цвет мет. опор'!A:B,2,0),\".\",VLOOKUP($K$5,'Цвет столешницы'!A:B,2,FALSE))","v":"EVL844/А/60*30/ANT.U003"},null,"5400*1436*750",null,91306]
[null,null,"Кодировка Артикула стола"]
[null,null,"Модель стола разворот стола /Цвет опор/Цв. заглушки. Цвет столешницы  "]
[null,"МОДЕЛЬ СТОЛА (ФОРМА, РАЗМЕР)","ПРАВОСТОРОННИЙ /ЛЕВОСТОРОННИЙ","ЦВЕТ ОПОР","ЦВЕТ ЗАГЛУШКИ, РУЧЕК","ЦВЕТ СТОЛЕШНИЦЫ"]
[null,null,"SX-левый","АNT-АНТРАЦИТ","АNT-АНТРАЦИТ","H","Белый"]
[null,null,"DX-правый","WHT-БЕЛЫЙ ","H-БЕЛЫЙ ","U727 ","Серый Камень"]
[null,null,null,"GR-СЕРЫЙ","G-СЕРЫЙ","R2","Серый"]
[null,null,null,null,null,"ANT","Антрацит"]
[null,null,null,null,null,"U003","Дуб Честерфилд"]
[null,null,null,null,null,"L","Дуб 131"]

{"sheet":"Столы на О обр. 60х30","index":4,"n_rows":198,"n_cols":11,"rows_kept":198,"cut":false,"hidden":false,"merged":[[33,2,38,2],[33,4,38,4],[29,5,30,5],[31,5,32,5],[132,1,132,4],[169,1,169,4],[139,2,141,2],[139,4,141,4],[142,2,144,2],[142,4,144,4],[145,2,147,2],[145,4,147,4],[96,2,100,2],[96,4,100,4],[101,2,105,2],[101,4,105,4],[106,2,110,2],[106,4,110,4],[136,2,138,2],[136,4,138,4],[111,2,115,2],[111,4,115,4],[37,3,38,3],[35,3,36,3],[175,2,179,2],[175,4,179,4],[154,4,156,4],[121,2,125,2],[121,4,125,4],[126,2,131,2],[1,1,1,5],[2,1,4,5],[148,2,150,2],[148,4,150,4],[151,2,153,2],[151,4,153,4],[87,2,89,2],[87,4,89,4],[90,2,92,2],[66,4,68,4],[69,2,70,2],[69,4,70,4],[71,2,72,2],[71,4,72,4],[66,2,68,2],[21,4,22,4],[116,4,120,4],[90,4,92,4],[2,8,2,10],[166,2,168,2],[166,4,168,4],[157,2,159,2],[160,2,162,2],[160,4,162,4],[163,2,165,2],[163,4,165,4],[6,2,9,2],[6,4,9,4],[10,2,14,2],[10,4,14,4],[15,2,19,2],[15,4,19,4],[21,2,22,2],[73,2,74,2],[73,4,74,4],[55,4,58,4],[51,2,54,2],[51,4,54,4],[63,2,65,2],[63,4,65,4],[116,2,120,2],[191,5,191,6],[94,4,95,4],[94,2,95,2],[185,2,188,2],[185,4,188,4],[59,4,62,4],[59,2,62,2],[55,2,58,2],[126,4,131,4],[133,2,135,2],[133,4,135,4],[75,2,77,2],[75,4,77,4],[78,2,80,2],[78,4,80,4],[81,2,83,2],[81,4,83,4],[84,2,86,2],[84,4,86,4],[154,2,156,2],[180,2,184,2],[180,4,184,4],[157,4,159,4],[170,4,174,4],[170,2,174,2],[39,3,40,3],[41,3,42,3],[39,4,42,4],[47,2,50,2],[43,2,46,2],[43,4,46,4],[47,4,50,4],[39,5,40,5],[39,2,42,2],[47,5,48,5],[49,5,50,5],[49,3,50,3],[47,3,48,3],[45,3,46,3],[43,3,44,3],[43,5,44,5],[45,5,46,5],[41,5,42,5],[33,3,34,3],[37,5,38,5],[35,5,36,5],[33,5,34,5],[23,5,24,5],[31,3,32,3],[29,3,30,3],[29,4,32,4],[29,2,32,2],[27,5,28,5],[25,5,26,5],[23,2,28,2],[23,4,28,4],[23,3,24,3],[25,3,26,3],[27,3,28,3]]}
[null,"EVOLUTION",null,null,null,{"$f":"Склаская!$F$1","v":"2025-05-23"}]
[null,"Столы, бенчи и рабочие станции на металлокаркасе: О-образные опоры - труба с сечением 60*30мм, траверсы - труба 40*20мм в цв. Антрацит.  Столешницы ЛДСП - 25 мм."]
[null,"Не складская программа производятся на заказ партией от 6 шт., со сроком по согласованию с производством, в цвете: Дуб Честерфилд, Белый, Антрацит, Серый R2, Дуб 131, Серый камень, Венге Цаво, Бетон. \nОпоры столов в цв. Антрацит, Белый, Серый.\nЗаглушки кабель-каналов и ручки тумб Антрацит, Белый.\nДля заказа изделия следует пользоваться правилами кодировки для создания  артикула. →→→",null,null,null,null,null,null,"Формирование артикула \nв зависимости от выбранных характеристик"]
[null,null,null,null,null,null,null,null,"Цвет Опор","Цвет кабель-канала","Цвет столешницы"]
[null,null,null,null,null,null,null,null,"Белый","Антрацит","Дуб 131"]
[null,"Артикул","Наименование","Размеры Ш*Г*В (мм)","Изображение","Розничная Цена, руб."]
["EVL113/О/60*30/",{"$f":"CONCATENATE(A7,VLOOKUP($I$5,'Цвет мет. опор'!A:B,2,0),\"/\",VLOOKUP($J$5,'Цвет лючка'!A:B,2,0),\".\",VLOOKUP($K$5,'Цвет столешницы'!A:B,2,FALSE))","v":"EVL113/О/60*30/WHT/ANT.L"},"Стол письменный на О образном  м/к 60х30, глубиной 600 мм","1000*600*750",null,19058]
["EVL114/О/60*30/",{"$f":"CONCATENATE(A8,VLOOKUP($I$5,'Цвет мет. опор'!A:B,2,0),\"/\",VLOOKUP($J$5,'Цвет лючка'!A:B,2,0),\".\",VLOOKUP($K$5,'Цвет столешницы'!A:B,2,FALSE))","v":"EVL114/О/60*30/WHT/ANT.L"},null,"1200*600*750",null,19624]
["EVL115/О/60*30/",{"$f":"CONCATENATE(A9,VLOOKUP($I$5,'Цвет мет. опор'!A:B,2,0),\"/\",VLOOKUP($J$5,'Цвет лючка'!A:B,2,0),\".\",VLOOKUP($K$5,'Цвет столешницы'!A:B,2,FALSE))","v":"EVL115/О/60*30/WHT/ANT.L"},null,"1400*600*750",null,20070]
["EVL116/О/60*30/",{"$f":"CONCATENATE(A10,VLOOKUP($I$5,'Цвет мет. опор'!A:B,2,0),\"/\",VLOOKUP($J$5,'Цвет лючка'!A:B,2,0),\".\",VLOOKUP($K$5,'Цвет столешницы'!A:B,2,FALSE))","v":"EVL116/О/60*30/WHT/ANT.L"},null,"1600*600*750",null,21152]
["EVL100/О/60*30/",{"$f":"CONCATENATE(A11,VLOOKUP($I$5,'Цвет мет. опор'!A:B,2,0),\"/\",VLOOKUP($J$5,'Цвет лючка'!A:B,2,0),\".\",VLOOKUP($K$5,'Цвет столешницы'!A:B,2,FALSE))","v":"EVL100/О/60*30/WHT/ANT.L"},"Стол письменный на О образном  м/к 60х30, глубиной 700 мм","1000*700*750",null,19861]
["EVL101/О/60*30/",{"$f":"CONCATENATE(A12,VLOOKUP($I$5,'Цвет мет. опор'!A:B,2,0),\"/\",VLOOKUP($J$5,'Цвет лючка'!A:B,2,0),\".\",VLOOKUP($K$5,'Цвет столешницы'!A:B,2,FALSE))","v":"EVL101/О/60*30/WHT/ANT.L"},null,"1200*700*750",null,20577]
["EVL102/О/60*30/",{"$f":"CONCATENATE(A13,VLOOKUP($I$5,'Цвет мет. опор'!A:B,2,0),\"/\",VLOOKUP($J$5,'Цвет лючка'!A:B,2,0),\".\",VLOOKUP($K$5,'Цвет столешницы'!A:B,2,FALSE))","v":"EVL102/О/60*30/WHT/ANT.L"},null,"1400*700*750",null,21309]
["EVL103/О/60*30/",{"$f":"CONCATENATE(A14,VLOOKUP($I$5,'Цвет мет. опор'!A:B,2,0),\"/\",VLOOKUP($J$5,'Цвет лючка'!A:B,2,0),\".\",VLOOKUP($K$5,'Цвет столешницы'!A:B,2,FALSE))","v":"EVL103/О/60*30/WHT/ANT.L"},null,"1600*700*750",null,22123]
["EVL104/О/60*30/",{"$f":"CONCATENATE(A15,VLOOKUP($I$5,'Цвет мет. опор'!A:B,2,0),\"/\",VLOOKUP($J$5,'Цвет лючка'!A:B,2,0),\".\",VLOOKUP($K$5,'Цвет столешницы'!A:B,2,FALSE))","v":"EVL104/О/60*30/WHT/ANT.L"},null,"1800*700*750",null,22826]
["EVL117/О/60*30/",{"$f":"CONCATENATE(A16,VLOOKUP($I$5,'Цвет мет. опор'!A:B,2,0),\"/\",VLOOKUP($J$5,'Цвет лючка'!A:B,2,0),\".\",VLOOKUP($K$5,'Цвет столешницы'!A:B,2,FALSE))","v":"EVL117/О/60*30/WHT/ANT.L"},"Стол письменный на О образном  м/к 60х30, глубиной 800 мм","1000*800*750",null,19869]
["EVL118/О/60*30/",{"$f":"CONCATENATE(A17,VLOOKUP($I$5,'Цвет мет. опор'!A:B,2,0),\"/\",VLOOKUP($J$5,'Цвет лючка'!A:B,2,0),\".\",VLOOKUP($K$5,'Цвет столешницы'!A:B,2,FALSE))","v":"EVL118/О/60*30/WHT/ANT.L"},null,"1200*800*750",null,20825]
["EVL119/О/60*30/",{"$f":"CONCATENATE(A18,VLOOKUP($I$5,'Цвет мет. опор'!A:B,2,0),\"/\",VLOOKUP($J$5,'Цвет лючка'!A:B,2,0),\".\",VLOOKUP($K$5,'Цвет столешницы'!A:B,2,FALSE))","v":"EVL119/О/60*30/WHT/ANT.L"},null,"1400*800*750",null,21943]
["EVL120/О/60*30/",{"$f":"CONCATENATE(A19,VLOOKUP($I$5,'Цвет мет. опор'!A:B,2,0),\"/\",VLOOKUP($J$5,'Цвет лючка'!A:B,2,0),\".\",VLOOKUP($K$5,'Цвет столешницы'!A:B,2,FALSE))","v":"EVL120/О/60*30/WHT/ANT.L"},null,"1600*800*750",null,22429]
["EVL121/О/60*30/",{"$f":"CONCATENATE(A20,VLOOKUP($I$5,'Цвет мет. опор'!A:B,2,0),\"/\",VLOOKUP($J$5,'Цвет лючка'!A:B,2,0),\".\",VLOOKUP($K$5,'Цвет столешницы'!A:B,2,FALSE))","v":"EVL121/О/60*30/WHT/ANT.L"},null,"1800*800*750",null,23433]
["EVL122/О/60*30/",{"$f":"CONCATENATE(A21,VLOOKUP($I$5,'Цвет мет. опор'!A:B,2,0),\"/\",VLOOKUP($J$5,'Цвет лючка'!A:B,2,0),\".\",VLOOKUP($K$5,'Цвет столешницы'!A:B,2,FALSE))","v":"EVL122/О/60*30/WHT/ANT.L"},"Стол письменный на О образном  м/к 60х30, глубиной 900 мм","1800*900*750",null,24871]
["EVL123/О/60*30/",{"$f":"CONCATENATE(A22,VLOOKUP($I$5,'Цвет мет. опор'!A:B,2,0),\"/\",VLOOKUP($J$5,'Цвет лючка'!A:B,2,0),\".\",VLOOKUP($K$5,'Цвет столешницы'!A:B,2,FALSE))","v":"EVL123/О/60*30/WHT/ANT.L"},"Стол криволинейный левый/правый на О образном  м/к 60х30, глубиной 600/900 мм","1200*900*750","правый",20901]
["EVL124/О/60*30/",{"$f":"CONCATENATE(A23,VLOOKUP($I$5,'Цвет мет. опор'!A:B,2,0),\"/\",VLOOKUP($J$5,'Цвет лючка'!A:B,2,0),\".\",VLOOKUP($K$5,'Цвет столешницы'!A:B,2,FALSE))","v":"EVL124/О/60*30/WHT/ANT.L"},null,"1400*900*750",null,21798]
["EVL105SX/О/60*30/",{"$f":"CONCATENATE(A24,VLOOKUP($I$5,'Цвет мет. опор'!A:B,2,0),\"/\",VLOOKUP($J$5,'Цвет лючка'!A:B,2,0),\".\",VLOOKUP($K$5,'Цвет столешницы'!A:B,2,FALSE))","v":"EVL105SX/О/60*30/WHT/ANT.L"},"Стол криволинейный левый/правый на О образном  м/к 60х30, глубиной 700/900 мм","1200*900*750","правый",20602]
["EVL105DX/О/60*30/",{"$f":"CONCATENATE(A25,VLOOKUP($I$5,'Цвет мет. опор'!A:B,2,0),\"/\",VLOOKUP($J$5,'Цвет лючка'!A:B,2,0),\".\",VLOOKUP($K$5,'Цвет столешницы'!A:B,2,FALSE))","v":"EVL105DX/О/60*30/WHT/ANT.L"}]
["EVL106SX/О/60*30/",{"$f":"CONCATENATE(A26,VLOOKUP($I$5,'Цвет мет. опор'!A:B,2,0),\"/\",VLOOKUP($J$5,'Цвет лючка'!A:B,2,0),\".\",VLOOKUP($K$5,'Цвет столешницы'!A:B,2,FALSE))","v":"EVL106SX/О/60*30/WHT/ANT.L"},null,"1400*900*750",null,21652]
["EVL106DX/О/60*30/",{"$f":"CONCATENATE(A27,VLOOKUP($I$5,'Цвет мет. опор'!A:B,2,0),\"/\",VLOOKUP($J$5,'Цвет лючка'!A:B,2,0),\".\",VLOOKUP($K$5,'Цвет столешницы'!A:B,2,FALSE))","v":"EVL106DX/О/60*30/WHT/ANT.L"}]
["EVL107SX/О/60*30/",{"$f":"CONCATENATE(A28,VLOOKUP($I$5,'Цвет мет. опор'!A:B,2,0),\"/\",VLOOKUP($J$5,'Цвет лючка'!A:B,2,0),\".\",VLOOKUP($K$5,'Цвет столешницы'!A:B,2,FALSE))","v":"EVL107SX/О/60*30/WHT/ANT.L"},null,"1600*900*750",null,22345]
["EVL107DX/О/60*30/",{"$f":"CONCATENATE(A29,VLOOKUP($I$5,'Цвет мет. опор'!A:B,2,0),\"/\",VLOOKUP($J$5,'Цвет лючка'!A:B,2,0),\".\",VLOOKUP($K$5,'Цвет столешницы'!A:B,2,FALSE))","v":"EVL107DX/О/60*30/WHT/ANT.L"}]
["EVL125SX/О/60*30/",{"$f":"CONCATENATE(A30,VLOOKUP($I$5,'Цвет мет. опор'!A:B,2,0),\"/\",VLOOKUP($J$5,'Цвет лючка'!A:B,2,0),\".\",VLOOKUP($K$5,'Цвет столешницы'!A:B,2,FALSE))","v":"EVL125SX/О/60*30/WHT/ANT.L"},"Стол криволинейный левый/правый на О образном  м/к 60х30, глубиной 800/900 мм","1400*900*750","правый",22457]
["EVL125DX/О/60*30/",{"$f":"CONCATENATE(A31,VLOOKUP($I$5,'Цвет мет. опор'!A:B,2,0),\"/\",VLOOKUP($J$5,'Цвет лючка'!A:B,2,0),\".\",VLOOKUP($K$5,'Цвет столешницы'!A:B,2,FALSE))","v":"EVL125DX/О/60*30/WHT/ANT.L"}]
["EVL126SX/О/60*30/",{"$f":"CONCATENATE(A32,VLOOKUP($I$5,'Цвет мет. опор'!A:B,2,0),\"/\",VLOOKUP($J$5,'Цвет лючка'!A:B,2,0),\".\",VLOOKUP($K$5,'Цвет столешницы'!A:B,2,FALSE))","v":"EVL126SX/О/60*30/WHT/ANT.L"},null,"1600*900*750",null,23064]
["EVL126DX/О/60*30/",{"$f":"CONCATENATE(A33,VLOOKUP($I$5,'Цвет мет. опор'!A:B,2,0),\"/\",VLOOKUP($J$5,'Цвет лючка'!A:B,2,0),\".\",VLOOKUP($K$5,'Цвет столешницы'!A:B,2,FALSE))","v":"EVL126DX/О/60*30/WHT/ANT.L"}]
["EVL109SX/О/60*30",{"$f":"CONCATENATE(A34,VLOOKUP($I$5,'Цвет мет. опор'!A:B,2,0),\"/\",VLOOKUP($J$5,'Цвет лючка'!A:B,2,0),\".\",VLOOKUP($K$5,'Цвет столешницы'!A:B,2,FALSE))","v":"EVL109SX/О/60*30WHT/ANT.L"},"Стол эргономичный левый/правый на О образном  м/к 60х30, глубиной 700/900 мм","1200х900/700х750","\nправый",20579]
["EVL109DX/О/60*31",{"$f":"CONCATENATE(A35,VLOOKUP($I$5,'Цвет мет. опор'!A:B,2,0),\"/\",VLOOKUP($J$5,'Цвет лючка'!A:B,2,0),\".\",VLOOKUP($K$5,'Цвет столешницы'!A:B,2,FALSE))","v":"EVL109DX/О/60*31WHT/ANT.L"}]
["EVL110SX/О/60*30",{"$f":"CONCATENATE(A36,VLOOKUP($I$5,'Цвет мет. опор'!A:B,2,0),\"/\",VLOOKUP($J$5,'Цвет лючка'!A:B,2,0),\".\",VLOOKUP($K$5,'Цвет столешницы'!A:B,2,FALSE))","v":"EVL110SX/О/60*30WHT/ANT.L"},null,"1400х900/700х750",null,21447]
["EVL110DX/О/60*31",{"$f":"CONCATENATE(A37,VLOOKUP($I$5,'Цвет мет. опор'!A:B,2,0),\"/\",VLOOKUP($J$5,'Цвет лючка'!A:B,2,0),\".\",VLOOKUP($K$5,'Цвет столешницы'!A:B,2,FALSE))","v":"EVL110DX/О/60*31WHT/ANT.L"}]
["EVL111SX/О/60*30",{"$f":"CONCATENATE(A38,VLOOKUP($I$5,'Цвет мет. опор'!A:B,2,0),\"/\",VLOOKUP($J$5,'Цвет лючка'!A:B,2,0),\".\",VLOOKUP($K$5,'Цвет столешницы'!A:B,2,FALSE))","v":"EVL111SX/О/60*30WHT/ANT.L"},null,"1600х900/700х750",null,22319]
["EVL111DX/О/60*31",{"$f":"CONCATENATE(A39,VLOOKUP($I$5,'Цвет мет. опор'!A:B,2,0),\"/\",VLOOKUP($J$5,'Цвет лючка'!A:B,2,0),\".\",VLOOKUP($K$5,'Цвет столешницы'!A:B,2,FALSE))","v":"EVL111DX/О/60*31WHT/ANT.L"}]
["EVL127SX/О/60*30/",{"$f":"CONCATENATE(A40,VLOOKUP($I$5,'Цвет мет. опор'!A:B,2,0),\"/\",VLOOKUP($J$5,'Цвет лючка'!A:B,2,0),\".\",VLOOKUP($K$5,'Цвет столешницы'!A:B,2,FALSE))","v":"EVL127SX/О/60*30/WHT/ANT.L"},"Стол эргономичный левый/правый на О образном  м/к 60х30, глубиной 600/1200 мм","1400*1200*750",null,32639]
["EVL127DX/О/60*30/",{"$f":"CONCATENATE(A41,VLOOKUP($I$5,'Цвет мет. опор'!A:B,2,0),\"/\",VLOOKUP($J$5,'Цвет лючка'!A:B,2,0),\".\",VLOOKUP($K$5,'Цвет столешницы'!A:B,2,FALSE))","v":"EVL127DX/О/60*30/WHT/ANT.L"}]
["EVL128SX/О/60*30/",{"$f":"CONCATENATE(A42,VLOOKUP($I$5,'Цвет мет. опор'!A:B,2,0),\"/\",VLOOKUP($J$5,'Цвет лючка'!A:B,2,0),\".\",VLOOKUP($K$5,'Цвет столешницы'!A:B,2,FALSE))","v":"EVL128SX/О/60*30/WHT/ANT.L"},null,"1600*1200*750",null,33449]
["EVL128DX/О/60*30/",{"$f":"CONCATENATE(A43,VLOOKUP($I$5,'Цвет мет. опор'!A:B,2,0),\"/\",VLOOKUP($J$5,'Цвет лючка'!A:B,2,0),\".\",VLOOKUP($K$5,'Цвет столешницы'!A:B,2,FALSE))","v":"EVL128DX/О/60*30/WHT/ANT.L"}]
["EVL129SX/О/60*30/",{"$f":"CONCATENATE(A44,VLOOKUP($I$5,'Цвет мет. опор'!A:B,2,0),\"/\",VLOOKUP($J$5,'Цвет лючка'!A:B,2,0),\".\",VLOOKUP($K$5,'Цвет столешницы'!A:B,2,FALSE))","v":"EVL129SX/О/60*30/WHT/ANT.L"},"Стол эргономичный левый/правый на О образном  м/к 60х30, глубиной 700/1200 мм","1400*1200*750",null,33141]
["EVL129DX/О/60*30/",{"$f":"CONCATENATE(A45,VLOOKUP($I$5,'Цвет мет. опор'!A:B,2,0),\"/\",VLOOKUP($J$5,'Цвет лючка'!A:B,2,0),\".\",VLOOKUP($K$5,'Цвет столешницы'!A:B,2,FALSE))","v":"EVL129DX/О/60*30/WHT/ANT.L"}]
["EVL130SX/О/60*30/",{"$f":"CONCATENATE(A46,VLOOKUP($I$5,'Цвет мет. опор'!A:B,2,0),\"/\",VLOOKUP($J$5,'Цвет лючка'!A:B,2,0),\".\",VLOOKUP($K$5,'Цвет столешницы'!A:B,2,FALSE))","v":"EVL130SX/О/60*30/WHT/ANT.L"},null,"1600*1200*750",null,34290]
["EVL130DX/О/60*30/",{"$f":"CONCATENATE(A47,VLOOKUP($I$5,'Цвет мет. опор'!A:B,2,0),\"/\",VLOOKUP($J$5,'Цвет лючка'!A:B,2,0),\".\",VLOOKUP($K$5,'Цвет столешницы'!A:B,2,FALSE))","v":"EVL130DX/О/60*30/WHT/ANT.L"}]
["EVL131SX/О/60*30/",{"$f":"CONCATENATE(A48,VLOOKUP($I$5,'Цвет мет. опор'!A:B,2,0),\"/\",VLOOKUP($J$5,'Цвет лючка'!A:B,2,0),\".\",VLOOKUP($K$5,'Цвет столешницы'!A:B,2,FALSE))","v":"EVL131SX/О/60*30/WHT/ANT.L"},"Стол эргономичный левый/правый на О образном  м/к 60х30, глубиной 800/1200 мм","1400*1200*750",null,33224]
["EVL131DX/О/60*30/",{"$f":"CONCATENATE(A49,VLOOKUP($I$5,'Цвет мет. опор'!A:B,2,0),\"/\",VLOOKUP($J$5,'Цвет лючка'!A:B,2,0),\".\",VLOOKUP($K$5,'Цвет столешницы'!A:B,2,FALSE))","v":"EVL131DX/О/60*30/WHT/ANT.L"}]
["EVL132SX/О/60*30/",{"$f":"CONCATENATE(A50,VLOOKUP($I$5,'Цвет мет. опор'!A:B,2,0),\"/\",VLOOKUP($J$5,'Цвет лючка'!A:B,2,0),\".\",VLOOKUP($K$5,'Цвет столешницы'!A:B,2,FALSE))","v":"EVL132SX/О/60*30/WHT/ANT.L"},null,"1600*1200*750",null,33952]
["EVL132DX/О/60*30/",{"$f":"CONCATENATE(A51,VLOOKUP($I$5,'Цвет мет. опор'!A:B,2,0),\"/\",VLOOKUP($J$5,'Цвет лючка'!A:B,2,0),\".\",VLOOKUP($K$5,'Цвет столешницы'!A:B,2,FALSE))","v":"EVL132DX/О/60*30/WHT/ANT.L"}]
["EVL601/О/60*30/",{"$f":"CONCATENATE(A52,VLOOKUP($I$5,'Цвет мет. опор'!A:B,2,0),\"/\",VLOOKUP($J$5,'Цвет лючка'!A:B,2,0),\".\",VLOOKUP($K$5,'Цвет столешницы'!A:B,2,FALSE))","v":"EVL601/О/60*30/WHT/ANT.L"},"Рабочая станция на О образном  м/к 60х30, глубиной 1236 мм","1200*1236*750",null,34021]
["EVL602/О/60*30/",{"$f":"CONCATENATE(A53,VLOOKUP($I$5,'Цвет мет. опор'!A:B,2,0),\"/\",VLOOKUP($J$5,'Цвет лючка'!A:B,2,0),\".\",VLOOKUP($K$5,'Цвет столешницы'!A:B,2,FALSE))","v":"EVL602/О/60*30/WHT/ANT.L"},null,"1400*1236*750",null,35151]
["EVL603/О/60*30/",{"$f":"CONCATENATE(A54,VLOOKUP($I$5,'Цвет мет. опор'!A:B,2,0),\"/\",VLOOKUP($J$5,'Цвет лючка'!A:B,2,0),\".\",VLOOKUP($K$5,'Цвет столешницы'!A:B,2,FALSE))","v":"EVL603/О/60*30/WHT/ANT.L"},null,"1600*1236*750",null,36728]
["EVL681/О/60*30/",{"$f":"CONCATENATE(A55,VLOOKUP($I$5,'Цвет мет. опор'!A:B,2,0),\"/\",VLOOKUP($J$5,'Цвет лючка'!A:B,2,0),\".\",VLOOKUP($K$5,'Цвет столешницы'!A:B,2,FALSE))","v":"EVL681/О/60*30/WHT/ANT.L"},null,"1800*1236*751",null,38293]
["EVL604/О/60*30/",{"$f":"CONCATENATE(A56,VLOOKUP($I$5,'Цвет мет. опор'!A:B,2,0),\"/\",VLOOKUP($J$5,'Цвет лючка'!A:B,2,0),\".\",VLOOKUP($K$5,'Цвет столешницы'!A:B,2,FALSE))","v":"EVL604/О/60*30/WHT/ANT.L"},"Рабочая станция на О образном  м/к 60х30 глубиной 1436","1200*1436*750",null,34709]
["EVL605/О/60*30/",{"$f":"CONCATENATE(A57,VLOOKUP($I$5,'Цвет мет. опор'!A:B,2,0),\"/\",VLOOKUP($J$5,'Цвет лючка'!A:B,2,0),\".\",VLOOKUP($K$5,'Цвет столешницы'!A:B,2,FALSE))","v":"EVL605/О/60*30/WHT/ANT.L"},null,"1400*1436*750",null,36159]
["EVL606/О/60*30/",{"$f":"CONCATENATE(A58,VLOOKUP($I$5,'Цвет мет. опор'!A:B,2,0),\"/\",VLOOKUP($J$5,'Цвет лючка'!A:B,2,0),\".\",VLOOKUP($K$5,'Цвет столешницы'!A:B,2,FALSE))","v":"EVL606/О/60*30/WHT/ANT.L"},null,"1600*1436*750",null,36490]
["EVL682/О/60*30/",{"$f":"CONCATENATE(A59,VLOOKUP($I$5,'Цвет мет. опор'!A:B,2,0),\"/\",VLOOKUP($J$5,'Цвет лючка'!A:B,2,0),\".\",VLOOKUP($K$5,'Цвет столешницы'!A:B,2,FALSE))","v":"EVL682/О/60*30/WHT/ANT.L"},null,"1800*1436*751",null,40536]
["EVL607/О/60*30/",{"$f":"CONCATENATE(A60,VLOOKUP($I$5,'Цвет мет. опор'!A:B,2,0),\"/\",VLOOKUP($J$5,'Цвет лючка'!A:B,2,0),\".\",VLOOKUP($K$5,'Цвет столешницы'!A:B,2,FALSE))","v":"EVL607/О/60*30/WHT/ANT.L"},"Рабочая станция на О образном  м/к 60х30 глубиной 1636","1200*1636*750",null,38487]
["EVL608/О/60*30/",{"$f":"CONCATENATE(A61,VLOOKUP($I$5,'Цвет мет. опор'!A:B,2,0),\"/\",VLOOKUP($J$5,'Цвет лючка'!A:B,2,0),\".\",VLOOKUP($K$5,'Цвет столешницы'!A:B,2,FALSE))","v":"EVL608/О/60*30/WHT/ANT.L"},null,"1400*1636*750",null,40430]
["EVL609/О/60*30/",{"$f":"CONCATENATE(A62,VLOOKUP($I$5,'Цвет мет. опор'!A:B,2,0),\"/\",VLOOKUP($J$5,'Цвет лючка'!A:B,2,0),\".\",VLOOKUP($K$5,'Цвет столешницы'!A:B,2,FALSE))","v":"EVL609/О/60*30/WHT/ANT.L"},null,"1600*1636*750",null,41760]
["EVL683/О/60*30/",{"$f":"CONCATENATE(A63,VLOOKUP($I$5,'Цвет мет. опор'!A:B,2,0),\"/\",VLOOKUP($J$5,'Цвет лючка'!A:B,2,0),\".\",VLOOKUP($K$5,'Цвет столешницы'!A:B,2,FALSE))","v":"EVL683/О/60*30/WHT/ANT.L"},null,"1800*1636*750",null,42747]
["EVL610/О/60*30/",{"$f":"CONCATENATE(A64,VLOOKUP($I$5,'Цвет мет. опор'!A:B,2,0),\"/\",VLOOKUP($J$5,'Цвет лючка'!A:B,2,0),\".\",VLOOKUP($K$5,'Цвет столешницы'!A:B,2,FALSE))","v":"EVL610/О/60*30/WHT/ANT.L"},"Рабочая станция криволинейная на О образном  м/к 60х30 глубиной 1236/1836","1200*1836*750",null,36523]
["EVL611/О/60*30/",{"$f":"CONCATENATE(A65,VLOOKUP($I$5,'Цвет мет. опор'!A:B,2,0),\"/\",VLOOKUP($J$5,'Цвет лючка'!A:B,2,0),\".\",VLOOKUP($K$5,'Цвет столешницы'!A:B,2,FALSE))","v":"EVL611/О/60*30/WHT/ANT.L"},null,"1400*1836*750",null,37088]
["EVL612/О/60*30/",{"$f":"CONCATENATE(A66,VLOOKUP($I$5,'Цвет мет. опор'!A:B,2,0),\"/\",VLOOKUP($J$5,'Цвет лючка'!A:B,2,0),\".\",VLOOKUP($K$5,'Цвет столешницы'!A:B,2,FALSE))","v":"EVL612/О/60*30/WHT/ANT.L"},null,"1600*1836*750",null,38728]
["EVL613/О/60*30/",{"$f":"CONCATENATE(A67,VLOOKUP($I$5,'Цвет мет. опор'!A:B,2,0),\"/\",VLOOKUP($J$5,'Цвет лючка'!A:B,2,0),\".\",VLOOKUP($K$5,'Цвет столешницы'!A:B,2,FALSE))","v":"EVL613/О/60*30/WHT/ANT.L"},"Рабочая станция криволинейная на \nО-образном м/к 60х30 глубиной 1436/1836","1200*1836*750",null,35836]
["EVL614/О/60*30/",{"$f":"CONCATENATE(A68,VLOOKUP($I$5,'Цвет мет. опор'!A:B,2,0),\"/\",VLOOKUP($J$5,'Цвет лючка'!A:B,2,0),\".\",VLOOKUP($K$5,'Цвет столешницы'!A:B,2,FALSE))","v":"EVL614/О/60*30/WHT/ANT.L"},null,"1400*1836*750",null,35977]
["EVL615/О/60*30/",{"$f":"CONCATENATE(A69,VLOOKUP($I$5,'Цвет мет. опор'!A:B,2,0),\"/\",VLOOKUP($J$5,'Цвет лючка'!A:B,2,0),\".\",VLOOKUP($K$5,'Цвет столешницы'!A:B,2,FALSE))","v":"EVL615/О/60*30/WHT/ANT.L"},null,"1600*1836*750",null,38060]
["EVL616/О/60*30/",{"$f":"CONCATENATE(A70,VLOOKUP($I$5,'Цвет мет. опор'!A:B,2,0),\"/\",VLOOKUP($J$5,'Цвет лючка'!A:B,2,0),\".\",VLOOKUP($K$5,'Цвет столешницы'!A:B,2,FALSE))","v":"EVL616/О/60*30/WHT/ANT.L"},"Рабочая станция эргономичная на \nО-образном м/к 60х30 глубиной 1236/2436","1400*2436*750",null,60078]
["EVL617/О/60*30/",{"$f":"CONCATENATE(A71,VLOOKUP($I$5,'Цвет мет. опор'!A:B,2,0),\"/\",VLOOKUP($J$5,'Цвет лючка'!A:B,2,0),\".\",VLOOKUP($K$5,'Цвет столешницы'!A:B,2,FALSE))","v":"EVL617/О/60*30/WHT/ANT.L"},null,"1600*2436*750",null,61697]
["EVL618/О/60*30/",{"$f":"CONCATENATE(A72,VLOOKUP($I$5,'Цвет мет. опор'!A:B,2,0),\"/\",VLOOKUP($J$5,'Цвет лючка'!A:B,2,0),\".\",VLOOKUP($K$5,'Цвет столешницы'!A:B,2,FALSE))","v":"EVL618/О/60*30/WHT/ANT.L"},"Рабочая станция эргономичная на \nО-образном м/к 60х30 глубиной 1436/2436","1400*2440*750",null,60846]
["EVL619/О/60*30/",{"$f":"CONCATENATE(A73,VLOOKUP($I$5,'Цвет мет. опор'!A:B,2,0),\"/\",VLOOKUP($J$5,'Цвет лючка'!A:B,2,0),\".\",VLOOKUP($K$5,'Цвет столешницы'!A:B,2,FALSE))","v":"EVL619/О/60*30/WHT/ANT.L"},null,"1600*2440*750",null,62377]
["EVL620/О/60*30/",{"$f":"CONCATENATE(A74,VLOOKUP($I$5,'Цвет мет. опор'!A:B,2,0),\"/\",VLOOKUP($J$5,'Цвет лючка'!A:B,2,0),\".\",VLOOKUP($K$5,'Цвет столешницы'!A:B,2,FALSE))","v":"EVL620/О/60*30/WHT/ANT.L"},"Рабочая станция эргономичная на \nО-образном м/к 60х30 глубиной 1636/2436","1400*2440*750",null,64013]
["EVL621/О/60*30/",{"$f":"CONCATENATE(A75,VLOOKUP($I$5,'Цвет мет. опор'!A:B,2,0),\"/\",VLOOKUP($J$5,'Цвет лючка'!A:B,2,0),\".\",VLOOKUP($K$5,'Цвет столешницы'!A:B,2,FALSE))","v":"EVL621/О/60*30/WHT/ANT.L"},null,"1600*2440*750",null,65468]
["EVL622/О/60*30/",{"$f":"CONCATENATE(A76,VLOOKUP($I$5,'Цвет мет. опор'!A:B,2,0),\"/\",VLOOKUP($J$5,'Цвет лючка'!A:B,2,0),\".\",VLOOKUP($K$5,'Цвет столешницы'!A:B,2,FALSE))","v":"EVL622/О/60*30/WHT/ANT.L"},"Рабочая станция эргономичная на \nО-образном м/к 60х30 \nглубиной 600/900","2400*900*750",null,37688]
["EVL623/О/60*30/",{"$f":"CONCATENATE(A77,VLOOKUP($I$5,'Цвет мет. опор'!A:B,2,0),\"/\",VLOOKUP($J$5,'Цвет лючка'!A:B,2,0),\".\",VLOOKUP($K$5,'Цвет столешницы'!A:B,2,FALSE))","v":"EVL623/О/60*30/WHT/ANT.L"},null,"2800*900*750",null,39752]
["EVL624/О/60*30/",{"$f":"CONCATENATE(A78,VLOOKUP($I$5,'Цвет мет. опор'!A:B,2,0),\"/\",VLOOKUP($J$5,'Цвет лючка'!A:B,2,0),\".\",VLOOKUP($K$5,'Цвет столешницы'!A:B,2,FALSE))","v":"EVL624/О/60*30/WHT/ANT.L"},null,"3200*900*750",null,40992]
["EVL625/О/60*30/",{"$f":"CONCATENATE(A79,VLOOKUP($I$5,'Цвет мет. опор'!A:B,2,0),\"/\",VLOOKUP($J$5,'Цвет лючка'!A:B,2,0),\".\",VLOOKUP($K$5,'Цвет столешницы'!A:B,2,FALSE))","v":"EVL625/О/60*30/WHT/ANT.L"},"Рабочая станция эргономичная на \nО-образном м/к 60х30 \nглубиной 700/900","2400*900*750",null,36923]
["EVL626/О/60*30/",{"$f":"CONCATENATE(A80,VLOOKUP($I$5,'Цвет мет. опор'!A:B,2,0),\"/\",VLOOKUP($J$5,'Цвет лючка'!A:B,2,0),\".\",VLOOKUP($K$5,'Цвет столешницы'!A:B,2,FALSE))","v":"EVL626/О/60*30/WHT/ANT.L"},null,"2800*900*750",null,38843]
["EVL627/О/60*30/",{"$f":"CONCATENATE(A81,VLOOKUP($I$5,'Цвет мет. опор'!A:B,2,0),\"/\",VLOOKUP($J$5,'Цвет лючка'!A:B,2,0),\".\",VLOOKUP($K$5,'Цвет столешницы'!A:B,2,FALSE))","v":"EVL627/О/60*30/WHT/ANT.L"},null,"3200*900*750",null,40471]
["EVL628/О/60*30/",{"$f":"CONCATENATE(A82,VLOOKUP($I$5,'Цвет мет. опор'!A:B,2,0),\"/\",VLOOKUP($J$5,'Цвет лючка'!A:B,2,0),\".\",VLOOKUP($K$5,'Цвет столешницы'!A:B,2,FALSE))","v":"EVL628/О/60*30/WHT/ANT.L"},"Рабочая станция эргономичная на \nО-образном м/к 60х30 \nглубиной 800/900","2400*900*750",null,38077]
["EVL629/О/60*30/",{"$f":"CONCATENATE(A83,VLOOKUP($I$5,'Цвет мет. опор'!A:B,2,0),\"/\",VLOOKUP($J$5,'Цвет лючка'!A:B,2,0),\".\",VLOOKUP($K$5,'Цвет столешницы'!A:B,2,FALSE))","v":"EVL629/О/60*30/WHT/ANT.L"},null,"2800*900*750",null,40095]
["EVL630/О/60*30/",{"$f":"CONCATENATE(A84,VLOOKUP($I$5,'Цвет мет. опор'!A:B,2,0),\"/\",VLOOKUP($J$5,'Цвет лючка'!A:B,2,0),\".\",VLOOKUP($K$5,'Цвет столешницы'!A:B,2,FALSE))","v":"EVL630/О/60*30/WHT/ANT.L"},null,"3200*900*750",null,41309]
["EVL631/О/60*30/",{"$f":"CONCATENATE(A85,VLOOKUP($I$5,'Цвет мет. опор'!A:B,2,0),\"/\",VLOOKUP($J$5,'Цвет лючка'!A:B,2,0),\".\",VLOOKUP($K$5,'Цвет столешницы'!A:B,2,FALSE))","v":"EVL631/О/60*30/WHT/ANT.L"},"Рабочая станция эргономичная на \nО-образном м/к 60х30 \nглубиной 600/1200","2400*1236*750",null,42000]
["EVL632/О/60*30/",{"$f":"CONCATENATE(A86,VLOOKUP($I$5,'Цвет мет. опор'!A:B,2,0),\"/\",VLOOKUP($J$5,'Цвет лючка'!A:B,2,0),\".\",VLOOKUP($K$5,'Цвет столешницы'!A:B,2,FALSE))","v":"EVL632/О/60*30/WHT/ANT.L"},null,"2800*1236*750",null,44163]
["EVL633/О/60*30/",{"$f":"CONCATENATE(A87,VLOOKUP($I$5,'Цвет мет. опор'!A:B,2,0),\"/\",VLOOKUP($J$5,'Цвет лючка'!A:B,2,0),\".\",VLOOKUP($K$5,'Цвет столешницы'!A:B,2,FALSE))","v":"EVL633/О/60*30/WHT/ANT.L"},null,"3200*1236*750",null,45782]
["EVL634/О/60*30/",{"$f":"CONCATENATE(A88,VLOOKUP($I$5,'Цвет мет. опор'!A:B,2,0),\"/\",VLOOKUP($J$5,'Цвет лючка'!A:B,2,0),\".\",VLOOKUP($K$5,'Цвет столешницы'!A:B,2,FALSE))","v":"EVL634/О/60*30/WHT/ANT.L"},"Рабочая станция эргономичная на \nО-образном м/к 60х30 \nглубиной 700/1200","2400*1236*750",null,42414]
["EVL635/О/60*30/",{"$f":"CONCATENATE(A89,VLOOKUP($I$5,'Цвет мет. опор'!A:B,2,0),\"/\",VLOOKUP($J$5,'Цвет лючка'!A:B,2,0),\".\",VLOOKUP($K$5,'Цвет столешницы'!A:B,2,FALSE))","v":"EVL635/О/60*30/WHT/ANT.L"},null,"2800*1236*750",null,44884]
["EVL636/О/60*30/",{"$f":"CONCATENATE(A90,VLOOKUP($I$5,'Цвет мет. опор'!A:B,2,0),\"/\",VLOOKUP($J$5,'Цвет лючка'!A:B,2,0),\".\",VLOOKUP($K$5,'Цвет столешницы'!A:B,2,FALSE))","v":"EVL636/О/60*30/WHT/ANT.L"},null,"3200*1236*750",null,46559]
["EVL637/О/60*30/",{"$f":"CONCATENATE(A91,VLOOKUP($I$5,'Цвет мет. опор'!A:B,2,0),\"/\",VLOOKUP($J$5,'Цвет лючка'!A:B,2,0),\".\",VLOOKUP($K$5,'Цвет столешницы'!A:B,2,FALSE))","v":"EVL637/О/60*30/WHT/ANT.L"},"Рабочая станция эргономичная на \nО-образном м/к 60х30 \nглубиной 800/1200","2400*1236*750",null,42475]
["EVL638/О/60*30/",{"$f":"CONCATENATE(A92,VLOOKUP($I$5,'Цвет мет. опор'!A:B,2,0),\"/\",VLOOKUP($J$5,'Цвет лючка'!A:B,2,0),\".\",VLOOKUP($K$5,'Цвет столешницы'!A:B,2,FALSE))","v":"EVL638/О/60*30/WHT/ANT.L"},null,"2800*1236*750",null,45078]
["EVL639/О/60*30/",{"$f":"CONCATENATE(A93,VLOOKUP($I$5,'Цвет мет. опор'!A:B,2,0),\"/\",VLOOKUP($J$5,'Цвет лючка'!A:B,2,0),\".\",VLOOKUP($K$5,'Цвет столешницы'!A:B,2,FALSE))","v":"EVL639/О/60*30/WHT/ANT.L"},null,"3200*1236*750",null,46532]
["EVL180/O/60*30/",{"$f":"CONCATENATE(A94,VLOOKUP($I$5,'Цвет мет. опор'!A:B,2,0),\"/\",VLOOKUP($J$5,'Цвет лючка'!A:B,2,0),\".\",VLOOKUP($K$5,'Цвет столешницы'!A:B,2,FALSE))","v":"EVL180/O/60*30/WHT/ANT.L"},"Приставка к столу рабочая 1000х500","1000x500x750",null,12386]
["EVL135/О/60*30/",{"$f":"CONCATENATE(A95,VLOOKUP($I$5,'Цвет мет. опор'!A:B,2,0),\"/\",VLOOKUP($J$5,'Цвет лючка'!A:B,2,0),\".\",VLOOKUP($K$5,'Цвет столешницы'!A:B,2,FALSE))","v":"EVL135/О/60*30/WHT/ANT.L"},"Приставной элемент на О-образном м/к 60х30 \nглубиной 700 (используется только в качестве брифинга)","1000*600*750",null,14366]
["EVL137/О/60*30/",{"$f":"CONCATENATE(A96,VLOOKUP($I$5,'Цвет мет. опор'!A:B,2,0),\"/\",VLOOKUP($J$5,'Цвет лючка'!A:B,2,0),\".\",VLOOKUP($K$5,'Цвет столешницы'!A:B,2,FALSE))","v":"EVL137/О/60*30/WHT/ANT.L"},null,"1200*700*750",null,14979]
["EVL701/О/60*30/",{"$f":"CONCATENATE(A97,VLOOKUP($I$5,'Цвет мет. опор'!A:B,2,0),\"/\",VLOOKUP($J$5,'Цвет лючка'!A:B,2,0),\".\",VLOOKUP($K$5,'Цвет столешницы'!A:B,2,FALSE))","v":"EVL701/О/60*30/WHT/ANT.L"},"Рабочая станция на О образном  м/к 60х30 с тумбой \n(композиция стол+тумба)","1450*700*750","Тумба 450х700х750",35079]
["EVL702/О/60*30/",{"$f":"CONCATENATE(A98,VLOOKUP($I$5,'Цвет мет. опор'!A:B,2,0),\"/\",VLOOKUP($J$5,'Цвет лючка'!A:B,2,0),\".\",VLOOKUP($K$5,'Цвет столешницы'!A:B,2,FALSE))","v":"EVL702/О/60*30/WHT/ANT.L"},null,"1650*700*750",null,35244]
["EVL703/О/60*30/",{"$f":"CONCATENATE(A99,VLOOKUP($I$5,'Цвет мет. опор'!A:B,2,0),\"/\",VLOOKUP($J$5,'Цвет лючка'!A:B,2,0),\".\",VLOOKUP($K$5,'Цвет столешницы'!A:B,2,FALSE))","v":"EVL703/О/60*30/WHT/ANT.L"},null,"1850*700*750",null,36528]
["EVL704/О/60*30/",{"$f":"CONCATENATE(A100,VLOOKUP($I$5,'Цвет мет. опор'!A:B,2,0),\"/\",VLOOKUP($J$5,'Цвет лючка'!A:B,2,0),\".\",VLOOKUP($K$5,'Цвет столешницы'!A:B,2,FALSE))","v":"EVL704/О/60*30/WHT/ANT.L"},null,"2050*700*750",null,37342]
["EVL705/О/60*30/",{"$f":"CONCATENATE(A101,VLOOKUP($I$5,'Цвет мет. опор'!A:B,2,0),\"/\",VLOOKUP($J$5,'Цвет лючка'!A:B,2,0),\".\",VLOOKUP($K$5,'Цвет столешницы'!A:B,2,FALSE))","v":"EVL705/О/60*30/WHT/ANT.L"},null,"2250*700*750",null,38045]
["EVL706/О/60*30/",{"$f":"CONCATENATE(A102,VLOOKUP($I$5,'Цвет мет. опор'!A:B,2,0),\"/\",VLOOKUP($J$5,'Цвет лючка'!A:B,2,0),\".\",VLOOKUP($K$5,'Цвет столешницы'!A:B,2,FALSE))","v":"EVL706/О/60*30/WHT/ANT.L"},"Рабочая станция на О образном  м/к 60х30 с тумбой \n(композиция двойной бенч+тумба)","1450*1436*750","Тумба  450х1436х750",60054]
["EVL707/О/60*30/",{"$f":"CONCATENATE(A103,VLOOKUP($I$5,'Цвет мет. опор'!A:B,2,0),\"/\",VLOOKUP($J$5,'Цвет лючка'!A:B,2,0),\".\",VLOOKUP($K$5,'Цвет столешницы'!A:B,2,FALSE))","v":"EVL707/О/60*30/WHT/ANT.L"},null,"1650*1436*750",null,61779]
["EVL708/О/60*30/",{"$f":"CONCATENATE(A104,VLOOKUP($I$5,'Цвет мет. опор'!A:B,2,0),\"/\",VLOOKUP($J$5,'Цвет лючка'!A:B,2,0),\".\",VLOOKUP($K$5,'Цвет столешницы'!A:B,2,FALSE))","v":"EVL708/О/60*30/WHT/ANT.L"},null,"1850*1436*750",null,63477]
["EVL709/О/60*30/",{"$f":"CONCATENATE(A105,VLOOKUP($I$5,'Цвет мет. опор'!A:B,2,0),\"/\",VLOOKUP($J$5,'Цвет лючка'!A:B,2,0),\".\",VLOOKUP($K$5,'Цвет столешницы'!A:B,2,FALSE))","v":"EVL709/О/60*30/WHT/ANT.L"},null,"2050*1436*750",null,64580]
["EVL710/О/60*30/",{"$f":"CONCATENATE(A106,VLOOKUP($I$5,'Цвет мет. опор'!A:B,2,0),\"/\",VLOOKUP($J$5,'Цвет лючка'!A:B,2,0),\".\",VLOOKUP($K$5,'Цвет столешницы'!A:B,2,FALSE))","v":"EVL710/О/60*30/WHT/ANT.L"},null,"2250*1436*750",null,66073]
["EVL711/О/60*30/",{"$f":"CONCATENATE(A107,VLOOKUP($I$5,'Цвет мет. опор'!A:B,2,0),\"/\",VLOOKUP($J$5,'Цвет лючка'!A:B,2,0),\".\",VLOOKUP($K$5,'Цвет столешницы'!A:B,2,FALSE))","v":"EVL711/О/60*30/WHT/ANT.L"},"Рабочая станция на О образном  м/к 60х30 со шкафом-купе\n(композиция двойной бенч+шкаф-купе)","1410*1436*750","Шкаф-купе приставной  1440х410х750",53958]
["EVL712/О/60*30/",{"$f":"CONCATENATE(A108,VLOOKUP($I$5,'Цвет мет. опор'!A:B,2,0),\"/\",VLOOKUP($J$5,'Цвет лючка'!A:B,2,0),\".\",VLOOKUP($K$5,'Цвет столешницы'!A:B,2,FALSE))","v":"EVL712/О/60*30/WHT/ANT.L"},null,"1610*1436*750",null,55174]
["EVL713/О/60*30/",{"$f":"CONCATENATE(A109,VLOOKUP($I$5,'Цвет мет. опор'!A:B,2,0),\"/\",VLOOKUP($J$5,'Цвет лючка'!A:B,2,0),\".\",VLOOKUP($K$5,'Цвет столешницы'!A:B,2,FALSE))","v":"EVL713/О/60*30/WHT/ANT.L"},null,"1810*1436*750",null,56624]
["EVL714/О/60*30/",{"$f":"CONCATENATE(A110,VLOOKUP($I$5,'Цвет мет. опор'!A:B,2,0),\"/\",VLOOKUP($J$5,'Цвет лючка'!A:B,2,0),\".\",VLOOKUP($K$5,'Цвет столешницы'!A:B,2,FALSE))","v":"EVL714/О/60*30/WHT/ANT.L"},null,"2010*1436*750",null,56955]
["EVL715/О/60*30/",{"$f":"CONCATENATE(A111,VLOOKUP($I$5,'Цвет мет. опор'!A:B,2,0),\"/\",VLOOKUP($J$5,'Цвет лючка'!A:B,2,0),\".\",VLOOKUP($K$5,'Цвет столешницы'!A:B,2,FALSE))","v":"EVL715/О/60*30/WHT/ANT.L"},null,"2210*1436*750",null,59977]
["EVL716/О/60*30/",{"$f":"CONCATENATE(A112,VLOOKUP($I$5,'Цвет мет. опор'!A:B,2,0),\"/\",VLOOKUP($J$5,'Цвет лючка'!A:B,2,0),\".\",VLOOKUP($K$5,'Цвет столешницы'!A:B,2,FALSE))","v":"EVL716/О/60*30/WHT/ANT.L"},"Рабочая станция на О образном  м/к 60х30 со шкафом-купе\n(композиция двойной бенч+шкаф-купе)","1410*1436*1098","Шкаф-купе приставной   1440х410х1098",58820]
["EVL717/О/60*30/",{"$f":"CONCATENATE(A113,VLOOKUP($I$5,'Цвет мет. опор'!A:B,2,0),\"/\",VLOOKUP($J$5,'Цвет лючка'!A:B,2,0),\".\",VLOOKUP($K$5,'Цвет столешницы'!A:B,2,FALSE))","v":"EVL717/О/60*30/WHT/ANT.L"},null,"1610*1436*1098",null,60036]
["EVL718/О/60*30/",{"$f":"CONCATENATE(A114,VLOOKUP($I$5,'Цвет мет. опор'!A:B,2,0),\"/\",VLOOKUP($J$5,'Цвет лючка'!A:B,2,0),\".\",VLOOKUP($K$5,'Цвет столешницы'!A:B,2,FALSE))","v":"EVL718/О/60*30/WHT/ANT.L"},null,"1810*1436*1098",null,61486]
["EVL719/О/60*30/",{"$f":"CONCATENATE(A115,VLOOKUP($I$5,'Цвет мет. опор'!A:B,2,0),\"/\",VLOOKUP($J$5,'Цвет лючка'!A:B,2,0),\".\",VLOOKUP($K$5,'Цвет столешницы'!A:B,2,FALSE))","v":"EVL719/О/60*30/WHT/ANT.L"},null,"2010*1436*1098",null,61817]
["EVL720/О/60*30/",{"$f":"CONCATENATE(A116,VLOOKUP($I$5,'Цвет мет. опор'!A:B,2,0),\"/\",VLOOKUP($J$5,'Цвет лючка'!A:B,2,0),\".\",VLOOKUP($K$5,'Цвет столешницы'!A:B,2,FALSE))","v":"EVL720/О/60*30/WHT/ANT.L"},null,"2210*1436*1098",null,64839]
["EVL721/О/60*30/",{"$f":"CONCATENATE(A117,VLOOKUP($I$5,'Цвет мет. опор'!A:B,2,0),\"/\",VLOOKUP($J$5,'Цвет лючка'!A:B,2,0),\".\",VLOOKUP($K$5,'Цвет столешницы'!A:B,2,FALSE))","v":"EVL721/О/60*30/WHT/ANT.L"},"Стол письменный на О образном  м/к 60х30 со шкафом-купе\n(композиция двойной бенч+шкаф-купе)","1410*1240*1098","Шкаф-купе приставной 1240х410х1098",42810]
["EVL722/О/60*30/",{"$f":"CONCATENATE(A118,VLOOKUP($I$5,'Цвет мет. опор'!A:B,2,0),\"/\",VLOOKUP($J$5,'Цвет лючка'!A:B,2,0),\".\",VLOOKUP($K$5,'Цвет столешницы'!A:B,2,FALSE))","v":"EVL722/О/60*30/WHT/ANT.L"},null,"1610*1240*1098",null,43526]
["EVL723/О/60*30/",{"$f":"CONCATENATE(A119,VLOOKUP($I$5,'Цвет мет. опор'!A:B,2,0),\"/\",VLOOKUP($J$5,'Цвет лючка'!A:B,2,0),\".\",VLOOKUP($K$5,'Цвет столешницы'!A:B,2,FALSE))","v":"EVL723/О/60*30/WHT/ANT.L"},null,"1810*1240*1098",null,44259]
["EVL724/О/60*30/",{"$f":"CONCATENATE(A120,VLOOKUP($I$5,'Цвет мет. опор'!A:B,2,0),\"/\",VLOOKUP($J$5,'Цвет лючка'!A:B,2,0),\".\",VLOOKUP($K$5,'Цвет столешницы'!A:B,2,FALSE))","v":"EVL724/О/60*30/WHT/ANT.L"},null,"2010*1240*1098",null,45073]
["EVL725/О/60*30/",{"$f":"CONCATENATE(A121,VLOOKUP($I$5,'Цвет мет. опор'!A:B,2,0),\"/\",VLOOKUP($J$5,'Цвет лючка'!A:B,2,0),\".\",VLOOKUP($K$5,'Цвет столешницы'!A:B,2,FALSE))","v":"EVL725/О/60*30/WHT/ANT.L"},null,"2210*1240*1098",null,45775]
["EVL726/О/60*30/",{"$f":"CONCATENATE(A122,VLOOKUP($I$5,'Цвет мет. опор'!A:B,2,0),\"/\",VLOOKUP($J$5,'Цвет лючка'!A:B,2,0),\".\",VLOOKUP($K$5,'Цвет столешницы'!A:B,2,FALSE))","v":"EVL726/О/60*30/WHT/ANT.L"},"Рабочая станция на О образном  м/к 60х30 со шкафом-купе\n(композиция двойной бенч+шкаф-купе)","1410*2332*1098","Шкаф-купе приставной \n2332х410х1098",82467]
["EVL727/О/60*30/",{"$f":"CONCATENATE(A123,VLOOKUP($I$5,'Цвет мет. опор'!A:B,2,0),\"/\",VLOOKUP($J$5,'Цвет лючка'!A:B,2,0),\".\",VLOOKUP($K$5,'Цвет столешницы'!A:B,2,FALSE))","v":"EVL727/О/60*30/WHT/ANT.L"},null,"1610*2332*1098",null,83683]
["EVL728/О/60*30/",{"$f":"CONCATENATE(A124,VLOOKUP($I$5,'Цвет мет. опор'!A:B,2,0),\"/\",VLOOKUP($J$5,'Цвет лючка'!A:B,2,0),\".\",VLOOKUP($K$5,'Цвет столешницы'!A:B,2,FALSE))","v":"EVL728/О/60*30/WHT/ANT.L"},null,"1810*2332*1098",null,85132]
["EVL729/О/60*30/",{"$f":"CONCATENATE(A125,VLOOKUP($I$5,'Цвет мет. опор'!A:B,2,0),\"/\",VLOOKUP($J$5,'Цвет лючка'!A:B,2,0),\".\",VLOOKUP($K$5,'Цвет столешницы'!A:B,2,FALSE))","v":"EVL729/О/60*30/WHT/ANT.L"},null,"2010*2332*1098",null,85463]
["EVL730/О/60*30/",{"$f":"CONCATENATE(A126,VLOOKUP($I$5,'Цвет мет. опор'!A:B,2,0),\"/\",VLOOKUP($J$5,'Цвет лючка'!A:B,2,0),\".\",VLOOKUP($K$5,'Цвет столешницы'!A:B,2,FALSE))","v":"EVL730/О/60*30/WHT/ANT.L"},null,"2210*2332*1098",null,88486]
["EVL731/О/60*30/",{"$f":"CONCATENATE(A127,VLOOKUP($I$5,'Цвет мет. опор'!A:B,2,0),\"/\",VLOOKUP($J$5,'Цвет лючка'!A:B,2,0),\".\",VLOOKUP($K$5,'Цвет столешницы'!A:B,2,FALSE))","v":"EVL731/О/60*30/WHT/ANT.L"},"Рабочая станция на О образном  м/к 60х30 с  тумбой левая/правая","1450*1250*750 L","правый",34756]
["EVL732/О/60*30/",{"$f":"CONCATENATE(A128,VLOOKUP($I$5,'Цвет мет. опор'!A:B,2,0),\"/\",VLOOKUP($J$5,'Цвет лючка'!A:B,2,0),\".\",VLOOKUP($K$5,'Цвет столешницы'!A:B,2,FALSE))","v":"EVL732/О/60*30/WHT/ANT.L"},null,"1450*1250*750 R",null,34756]
["EVL733/О/60*30/",{"$f":"CONCATENATE(A129,VLOOKUP($I$5,'Цвет мет. опор'!A:B,2,0),\"/\",VLOOKUP($J$5,'Цвет лючка'!A:B,2,0),\".\",VLOOKUP($K$5,'Цвет столешницы'!A:B,2,FALSE))","v":"EVL733/О/60*30/WHT/ANT.L"},null,"1650*1250*750 L",null,35086]
["EVL734/О/60*30/",{"$f":"CONCATENATE(A130,VLOOKUP($I$5,'Цвет мет. опор'!A:B,2,0),\"/\",VLOOKUP($J$5,'Цвет лючка'!A:B,2,0),\".\",VLOOKUP($K$5,'Цвет столешницы'!A:B,2,FALSE))","v":"EVL734/О/60*30/WHT/ANT.L"},null,"1650*1250*750 R",null,35086]
["EVL735/О/60*30/",{"$f":"CONCATENATE(A131,VLOOKUP($I$5,'Цвет мет. опор'!A:B,2,0),\"/\",VLOOKUP($J$5,'Цвет лючка'!A:B,2,0),\".\",VLOOKUP($K$5,'Цвет столешницы'!A:B,2,FALSE))","v":"EVL735/О/60*30/WHT/ANT.L"},null,"1850*1250*750 L",null,35416]
["EVL736/О/60*30/",{"$f":"CONCATENATE(A132,VLOOKUP($I$5,'Цвет мет. опор'!A:B,2,0),\"/\",VLOOKUP($J$5,'Цвет лючка'!A:B,2,0),\".\",VLOOKUP($K$5,'Цвет столешницы'!A:B,2,FALSE))","v":"EVL736/О/60*30/WHT/ANT.L"},null,"1850*1250*750 R",null,35416]
[null,"Бэнч-системы"]
["EVL645/О/60*30/",{"$f":"CONCATENATE(A134,VLOOKUP($I$5,'Цвет мет. опор'!A:B,2,0),\"/\",VLOOKUP($J$5,'Цвет лючка'!A:B,2,0),\".\",VLOOKUP($K$5,'Цвет столешницы'!A:B,2,FALSE))","v":"EVL645/О/60*30/WHT/ANT.L"},"Рабочая станция на 2 раб.места на О образном  м/к 60х30 (бенч-система) глубиной 600","2400*600*750",null,35186]
["EVL646/О/60*30/",{"$f":"CONCATENATE(A135,VLOOKUP($I$5,'Цвет мет. опор'!A:B,2,0),\"/\",VLOOKUP($J$5,'Цвет лючка'!A:B,2,0),\".\",VLOOKUP($K$5,'Цвет столешницы'!A:B,2,FALSE))","v":"EVL646/О/60*30/WHT/ANT.L"},null,"2800*600*750",null,36316]
["EVL647/О/60*30/",{"$f":"CONCATENATE(A136,VLOOKUP($I$5,'Цвет мет. опор'!A:B,2,0),\"/\",VLOOKUP($J$5,'Цвет лючка'!A:B,2,0),\".\",VLOOKUP($K$5,'Цвет столешницы'!A:B,2,FALSE))","v":"EVL647/О/60*30/WHT/ANT.L"},null,"3200*600*750",null,37893]
["EVL648/О/60*30/",{"$f":"CONCATENATE(A137,VLOOKUP($I$5,'Цвет мет. опор'!A:B,2,0),\"/\",VLOOKUP($J$5,'Цвет лючка'!A:B,2,0),\".\",VLOOKUP($K$5,'Цвет столешницы'!A:B,2,FALSE))","v":"EVL648/О/60*30/WHT/ANT.L"},"Рабочая станция на 2 раб.места на О образном  м/к 60х30 (бенч-система) глубиной 700","2400*700*750",null,36870]
["EVL649/О/60*30/",{"$f":"CONCATENATE(A138,VLOOKUP($I$5,'Цвет мет. опор'!A:B,2,0),\"/\",VLOOKUP($J$5,'Цвет лючка'!A:B,2,0),\".\",VLOOKUP($K$5,'Цвет столешницы'!A:B,2,FALSE))","v":"EVL649/О/60*30/WHT/ANT.L"},null,"2800*700*750",null,38273]
["EVL650/О/60*30/",{"$f":"CONCATENATE(A139,VLOOKUP($I$5,'Цвет мет. опор'!A:B,2,0),\"/\",VLOOKUP($J$5,'Цвет лючка'!A:B,2,0),\".\",VLOOKUP($K$5,'Цвет столешницы'!A:B,2,FALSE))","v":"EVL650/О/60*30/WHT/ANT.L"},null,"3200*700*750",null,39863]
["EVL651/О/60*30/",{"$f":"CONCATENATE(A140,VLOOKUP($I$5,'Цвет мет. опор'!A:B,2,0),\"/\",VLOOKUP($J$5,'Цвет лючка'!A:B,2,0),\".\",VLOOKUP($K$5,'Цвет столешницы'!A:B,2,FALSE))","v":"EVL651/О/60*30/WHT/ANT.L"},"Рабочая станция на 2 раб.места на О образном  м/к 60х30 (бенч-система) глубиной 800","2400*800*750",null,37124]
["EVL652/О/60*30/",{"$f":"CONCATENATE(A141,VLOOKUP($I$5,'Цвет мет. опор'!A:B,2,0),\"/\",VLOOKUP($J$5,'Цвет лючка'!A:B,2,0),\".\",VLOOKUP($K$5,'Цвет столешницы'!A:B,2,FALSE))","v":"EVL652/О/60*30/WHT/ANT.L"},null,"2800*800*750",null,39554]
["EVL653/О/60*30/",{"$f":"CONCATENATE(A142,VLOOKUP($I$5,'Цвет мет. опор'!A:B,2,0),\"/\",VLOOKUP($J$5,'Цвет лючка'!A:B,2,0),\".\",VLOOKUP($K$5,'Цвет столешницы'!A:B,2,FALSE))","v":"EVL653/О/60*30/WHT/ANT.L"},null,"3200*800*750",null,42683]
["EVL654/О/60*30/",{"$f":"CONCATENATE(A143,VLOOKUP($I$5,'Цвет мет. опор'!A:B,2,0),\"/\",VLOOKUP($J$5,'Цвет лючка'!A:B,2,0),\".\",VLOOKUP($K$5,'Цвет столешницы'!A:B,2,FALSE))","v":"EVL654/О/60*30/WHT/ANT.L"},"Рабочая станция на 3 раб.места на О образном  м/к 60х30 (бенч-система), глубиной 600 мм","3600*600*750",null,52505]
["EVL655/О/60*30/",{"$f":"CONCATENATE(A144,VLOOKUP($I$5,'Цвет мет. опор'!A:B,2,0),\"/\",VLOOKUP($J$5,'Цвет лючка'!A:B,2,0),\".\",VLOOKUP($K$5,'Цвет столешницы'!A:B,2,FALSE))","v":"EVL655/О/60*30/WHT/ANT.L"},null,"4200*600*750",null,55053]
["EVL656/О/60*30/",{"$f":"CONCATENATE(A145,VLOOKUP($I$5,'Цвет мет. опор'!A:B,2,0),\"/\",VLOOKUP($J$5,'Цвет лючка'!A:B,2,0),\".\",VLOOKUP($K$5,'Цвет столешницы'!A:B,2,FALSE))","v":"EVL656/О/60*30/WHT/ANT.L"},null,"4800*600*750",null,56706]
["EVL657/О/60*30/",{"$f":"CONCATENATE(A146,VLOOKUP($I$5,'Цвет мет. опор'!A:B,2,0),\"/\",VLOOKUP($J$5,'Цвет лючка'!A:B,2,0),\".\",VLOOKUP($K$5,'Цвет столешницы'!A:B,2,FALSE))","v":"EVL657/О/60*30/WHT/ANT.L"},"Рабочая станция на 3 раб.места на О образном  м/к 60х30 (бенч-система), глубиной 700 мм","3600*700*750",null,53018]
["EVL658/О/60*30/",{"$f":"CONCATENATE(A147,VLOOKUP($I$5,'Цвет мет. опор'!A:B,2,0),\"/\",VLOOKUP($J$5,'Цвет лючка'!A:B,2,0),\".\",VLOOKUP($K$5,'Цвет столешницы'!A:B,2,FALSE))","v":"EVL658/О/60*30/WHT/ANT.L"},null,"4200*700*750",null,55565]
["EVL659/О/60*30/",{"$f":"CONCATENATE(A148,VLOOKUP($I$5,'Цвет мет. опор'!A:B,2,0),\"/\",VLOOKUP($J$5,'Цвет лючка'!A:B,2,0),\".\",VLOOKUP($K$5,'Цвет столешницы'!A:B,2,FALSE))","v":"EVL659/О/60*30/WHT/ANT.L"},null,"4800*700*750",null,57219]
["EVL660/О/60*30/",{"$f":"CONCATENATE(A149,VLOOKUP($I$5,'Цвет мет. опор'!A:B,2,0),\"/\",VLOOKUP($J$5,'Цвет лючка'!A:B,2,0),\".\",VLOOKUP($K$5,'Цвет столешницы'!A:B,2,FALSE))","v":"EVL660/О/60*30/WHT/ANT.L"},"Рабочая станция на 3 раб.места на О образном  м/к 60х30 (бенч-система), глубиной 800 мм","3600*800*750",null,52452]
["EVL661/О/60*30/",{"$f":"CONCATENATE(A150,VLOOKUP($I$5,'Цвет мет. опор'!A:B,2,0),\"/\",VLOOKUP($J$5,'Цвет лючка'!A:B,2,0),\".\",VLOOKUP($K$5,'Цвет столешницы'!A:B,2,FALSE))","v":"EVL661/О/60*30/WHT/ANT.L"},null,"4200*800*750",null,55000]
["EVL662/О/60*30/",{"$f":"CONCATENATE(A151,VLOOKUP($I$5,'Цвет мет. опор'!A:B,2,0),\"/\",VLOOKUP($J$5,'Цвет лючка'!A:B,2,0),\".\",VLOOKUP($K$5,'Цвет столешницы'!A:B,2,FALSE))","v":"EVL662/О/60*30/WHT/ANT.L"},null,"4800*800*750",null,56654]
["EVL663/О/60*30/",{"$f":"CONCATENATE(A152,VLOOKUP($I$5,'Цвет мет. опор'!A:B,2,0),\"/\",VLOOKUP($J$5,'Цвет лючка'!A:B,2,0),\".\",VLOOKUP($K$5,'Цвет столешницы'!A:B,2,FALSE))","v":"EVL663/О/60*30/WHT/ANT.L"},"Рабочая станция на 4 раб.места на О образном  м/к 60х30","2400*1236*750",null,61447]
["EVL664/О/60*30/",{"$f":"CONCATENATE(A153,VLOOKUP($I$5,'Цвет мет. опор'!A:B,2,0),\"/\",VLOOKUP($J$5,'Цвет лючка'!A:B,2,0),\".\",VLOOKUP($K$5,'Цвет столешницы'!A:B,2,FALSE))","v":"EVL664/О/60*30/WHT/ANT.L"},null,"2800*1236*750",null,63707]
["EVL665/О/60*30/",{"$f":"CONCATENATE(A154,VLOOKUP($I$5,'Цвет мет. опор'!A:B,2,0),\"/\",VLOOKUP($J$5,'Цвет лючка'!A:B,2,0),\".\",VLOOKUP($K$5,'Цвет столешницы'!A:B,2,FALSE))","v":"EVL665/О/60*30/WHT/ANT.L"},null,"3200*1236*750",null,66861]
["EVL666/О/60*30/",{"$f":"CONCATENATE(A155,VLOOKUP($I$5,'Цвет мет. опор'!A:B,2,0),\"/\",VLOOKUP($J$5,'Цвет лючка'!A:B,2,0),\".\",VLOOKUP($K$5,'Цвет столешницы'!A:B,2,FALSE))","v":"EVL666/О/60*30/WHT/ANT.L"},"Рабочая станция на 4 раб.места на О образном  м/к 60х30","2400*1436*750",null,54435]
["EVL667/О/60*30/",{"$f":"CONCATENATE(A156,VLOOKUP($I$5,'Цвет мет. опор'!A:B,2,0),\"/\",VLOOKUP($J$5,'Цвет лючка'!A:B,2,0),\".\",VLOOKUP($K$5,'Цвет столешницы'!A:B,2,FALSE))","v":"EVL667/О/60*30/WHT/ANT.L"},null,"2800*1436*750",null,66228]
["EVL668/О/60*30/",{"$f":"CONCATENATE(A157,VLOOKUP($I$5,'Цвет мет. опор'!A:B,2,0),\"/\",VLOOKUP($J$5,'Цвет лючка'!A:B,2,0),\".\",VLOOKUP($K$5,'Цвет столешницы'!A:B,2,FALSE))","v":"EVL668/О/60*30/WHT/ANT.L"},null,"3200*1436*750",null,69811]
["EVL669/О/60*30/",{"$f":"CONCATENATE(A158,VLOOKUP($I$5,'Цвет мет. опор'!A:B,2,0),\"/\",VLOOKUP($J$5,'Цвет лючка'!A:B,2,0),\".\",VLOOKUP($K$5,'Цвет столешницы'!A:B,2,FALSE))","v":"EVL669/О/60*30/WHT/ANT.L"},"Рабочая станция на 4 раб.места на О образном  м/к 60х30","2400*1636*750",null,67878]
["EVL670/О/60*30/",{"$f":"CONCATENATE(A159,VLOOKUP($I$5,'Цвет мет. опор'!A:B,2,0),\"/\",VLOOKUP($J$5,'Цвет лючка'!A:B,2,0),\".\",VLOOKUP($K$5,'Цвет столешницы'!A:B,2,FALSE))","v":"EVL670/О/60*30/WHT/ANT.L"},null,"2800*1636*750",null,71763]
["EVL671/О/60*30/",{"$f":"CONCATENATE(A160,VLOOKUP($I$5,'Цвет мет. опор'!A:B,2,0),\"/\",VLOOKUP($J$5,'Цвет лючка'!A:B,2,0),\".\",VLOOKUP($K$5,'Цвет столешницы'!A:B,2,FALSE))","v":"EVL671/О/60*30/WHT/ANT.L"},null,"3200*1636*750",null,74424]
["EVL672/О/60*30/",{"$f":"CONCATENATE(A161,VLOOKUP($I$5,'Цвет мет. опор'!A:B,2,0),\"/\",VLOOKUP($J$5,'Цвет лючка'!A:B,2,0),\".\",VLOOKUP($K$5,'Цвет столешницы'!A:B,2,FALSE))","v":"EVL672/О/60*30/WHT/ANT.L"},"Рабочая станция на 6 раб.места на О образном м/к 60х30 с шириной 1-го рабочего места 600 мм","3600*1236*750",null,88873]
["EVL673/О/60*30/",{"$f":"CONCATENATE(A162,VLOOKUP($I$5,'Цвет мет. опор'!A:B,2,0),\"/\",VLOOKUP($J$5,'Цвет лючка'!A:B,2,0),\".\",VLOOKUP($K$5,'Цвет столешницы'!A:B,2,FALSE))","v":"EVL673/О/60*30/WHT/ANT.L"},null,"4200*1236*750",null,92263]
["EVL674/О/60*30/",{"$f":"CONCATENATE(A163,VLOOKUP($I$5,'Цвет мет. опор'!A:B,2,0),\"/\",VLOOKUP($J$5,'Цвет лючка'!A:B,2,0),\".\",VLOOKUP($K$5,'Цвет столешницы'!A:B,2,FALSE))","v":"EVL674/О/60*30/WHT/ANT.L"},null,"4800*1236*750",null,96994]
["EVL675/О/60*30/",{"$f":"CONCATENATE(A164,VLOOKUP($I$5,'Цвет мет. опор'!A:B,2,0),\"/\",VLOOKUP($J$5,'Цвет лючка'!A:B,2,0),\".\",VLOOKUP($K$5,'Цвет столешницы'!A:B,2,FALSE))","v":"EVL675/О/60*30/WHT/ANT.L"},"Рабочая станция на 6 раб.места на О образном м/к 60х30 с шириной 1-го рабочего места 700 мм","3600*1436*750",null,92560]
["EVL676/О/60*30/",{"$f":"CONCATENATE(A165,VLOOKUP($I$5,'Цвет мет. опор'!A:B,2,0),\"/\",VLOOKUP($J$5,'Цвет лючка'!A:B,2,0),\".\",VLOOKUP($K$5,'Цвет столешницы'!A:B,2,FALSE))","v":"EVL676/О/60*30/WHT/ANT.L"},null,"4200*1436*750",null,98296]
["EVL677/О/60*30/",{"$f":"CONCATENATE(A166,VLOOKUP($I$5,'Цвет мет. опор'!A:B,2,0),\"/\",VLOOKUP($J$5,'Цвет лючка'!A:B,2,0),\".\",VLOOKUP($K$5,'Цвет столешницы'!A:B,2,FALSE))","v":"EVL677/О/60*30/WHT/ANT.L"},null,"4800*1436*750",null,101603]
["EVL678/О/60*30/",{"$f":"CONCATENATE(A167,VLOOKUP($I$5,'Цвет мет. опор'!A:B,2,0),\"/\",VLOOKUP($J$5,'Цвет лючка'!A:B,2,0),\".\",VLOOKUP($K$5,'Цвет столешницы'!A:B,2,FALSE))","v":"EVL678/О/60*30/WHT/ANT.L"},"Рабочая станция на 6 раб.места на О образном м/к 60х30 с шириной 1-го рабочего места 800 мм","3600*1636*750",null,98965]
["EVL679/О/60*30/",{"$f":"CONCATENATE(A168,VLOOKUP($I$5,'Цвет мет. опор'!A:B,2,0),\"/\",VLOOKUP($J$5,'Цвет лючка'!A:B,2,0),\".\",VLOOKUP($K$5,'Цвет столешницы'!A:B,2,FALSE))","v":"EVL679/О/60*30/WHT/ANT.L"},null,"4200*1636*750",null,104793]
["EVL680/О/60*30/",{"$f":"CONCATENATE(A169,VLOOKUP($I$5,'Цвет мет. опор'!A:B,2,0),\"/\",VLOOKUP($J$5,'Цвет лючка'!A:B,2,0),\".\",VLOOKUP($K$5,'Цвет столешницы'!A:B,2,FALSE))","v":"EVL680/О/60*30/WHT/ANT.L"},null,"4800*1636*750",null,108784]
[null,"Переговорные столы"]
["EVL800/О/60*30/",{"$f":"CONCATENATE(A171,VLOOKUP($I$5,'Цвет мет. опор'!A:B,2,0),\".\",VLOOKUP($K$5,'Цвет столешницы'!A:B,2,FALSE))","v":"EVL800/О/60*30/WHT.L"},"Переговорный стол (1 столешница) \nна О образном  м/к 60х30","1000*1236*750",null,32821]
["EVL801/О/60*30/",{"$f":"CONCATENATE(A172,VLOOKUP($I$5,'Цвет мет. опор'!A:B,2,0),\".\",VLOOKUP($K$5,'Цвет столешницы'!A:B,2,FALSE))","v":"EVL801/О/60*30/WHT.L"},null,"1200*1236*750",null,34057]
["EVL802/О/60*30/",{"$f":"CONCATENATE(A173,VLOOKUP($I$5,'Цвет мет. опор'!A:B,2,0),\".\",VLOOKUP($K$5,'Цвет столешницы'!A:B,2,FALSE))","v":"EVL802/О/60*30/WHT.L"},null,"1400*1236*750",null,35710]
["EVL803/О/60*30/",{"$f":"CONCATENATE(A174,VLOOKUP($I$5,'Цвет мет. опор'!A:B,2,0),\".\",VLOOKUP($K$5,'Цвет столешницы'!A:B,2,FALSE))","v":"EVL803/О/60*30/WHT.L"},null,"1600*1236*750",null,37429]
["EVL804/О/60*30/",{"$f":"CONCATENATE(A175,VLOOKUP($I$5,'Цвет мет. опор'!A:B,2,0),\".\",VLOOKUP($K$5,'Цвет столешницы'!A:B,2,FALSE))","v":"EVL804/О/60*30/WHT.L"},null,"1800*1236*750",null,39323]
["EVL805/О/60*30/",{"$f":"CONCATENATE(A176,VLOOKUP($I$5,'Цвет мет. опор'!A:B,2,0),\".\",VLOOKUP($K$5,'Цвет столешницы'!A:B,2,FALSE))","v":"EVL805/О/60*30/WHT.L"},"Переговорный стол (2 столешницы)\n на О образном  м/к 60х30","2000*1236*750",null,53782]
["EVL806/О/60*30/",{"$f":"CONCATENATE(A177,VLOOKUP($I$5,'Цвет мет. опор'!A:B,2,0),\".\",VLOOKUP($K$5,'Цвет столешницы'!A:B,2,FALSE))","v":"EVL806/О/60*30/WHT.L"},null,"2400*1236*750",null,55875]
["EVL807/О/60*30/",{"$f":"CONCATENATE(A178,VLOOKUP($I$5,'Цвет мет. опор'!A:B,2,0),\".\",VLOOKUP($K$5,'Цвет столешницы'!A:B,2,FALSE))","v":"EVL807/О/60*30/WHT.L"},null,"2800*1236*750",null,58368]
["EVL808/О/60*30/",{"$f":"CONCATENATE(A179,VLOOKUP($I$5,'Цвет мет. опор'!A:B,2,0),\".\",VLOOKUP($K$5,'Цвет столешницы'!A:B,2,FALSE))","v":"EVL808/О/60*30/WHT.L"},null,"3200*1236*750",null,68531]
["EVL809/О/60*30/",{"$f":"CONCATENATE(A180,VLOOKUP($I$5,'Цвет мет. опор'!A:B,2,0),\".\",VLOOKUP($K$5,'Цвет столешницы'!A:B,2,FALSE))","v":"EVL809/О/60*30/WHT.L"},null,"3600*1236*750",null,72320]
["EVL810/О/60*30/",{"$f":"CONCATENATE(A181,VLOOKUP($I$5,'Цвет мет. опор'!A:B,2,0),\".\",VLOOKUP($K$5,'Цвет столешницы'!A:B,2,FALSE))","v":"EVL810/О/60*30/WHT.L"},"Переговорный стол (3 столешницы)\n на О образном  м/к 60х30","3000*1236*750",null,74781]
["EVL811/О/60*30/",{"$f":"CONCATENATE(A182,VLOOKUP($I$5,'Цвет мет. опор'!A:B,2,0),\".\",VLOOKUP($K$5,'Цвет столешницы'!A:B,2,FALSE))","v":"EVL811/О/60*30/WHT.L"},null,"3600*1236*750",null,81694]
["EVL812/О/60*30/",{"$f":"CONCATENATE(A183,VLOOKUP($I$5,'Цвет мет. опор'!A:B,2,0),\".\",VLOOKUP($K$5,'Цвет столешницы'!A:B,2,FALSE))","v":"EVL812/О/60*30/WHT.L"},null,"4200*1236*750",null,85434]
["EVL813/О/60*30/",{"$f":"CONCATENATE(A184,VLOOKUP($I$5,'Цвет мет. опор'!A:B,2,0),\".\",VLOOKUP($K$5,'Цвет столешницы'!A:B,2,FALSE))","v":"EVL813/О/60*30/WHT.L"},null,"4800*1236*750",null,87866]
["EVL814/О/60*30/",{"$f":"CONCATENATE(A185,VLOOKUP($I$5,'Цвет мет. опор'!A:B,2,0),\".\",VLOOKUP($K$5,'Цвет столешницы'!A:B,2,FALSE))","v":"EVL814/О/60*30/WHT.L"},null,"5400*1236*750",null,90961]
["EVL841/О/60*30/",{"$f":"CONCATENATE(A186,VLOOKUP($I$5,'Цвет мет. опор'!A:B,2,0),\".\",VLOOKUP($K$5,'Цвет столешницы'!A:B,2,FALSE))","v":"EVL841/О/60*30/WHT.L"},"Переговорный стол (3 столешницы)\n на О-образном м/к 60х30","3600*1436*750",null,84116]
["EVL842/О/60*30/",{"$f":"CONCATENATE(A187,VLOOKUP($I$5,'Цвет мет. опор'!A:B,2,0),\".\",VLOOKUP($K$5,'Цвет столешницы'!A:B,2,FALSE))","v":"EVL842/О/60*30/WHT.L"},null,"4200*1436*750",null,87964]
["EVL843/О/60*30/",{"$f":"CONCATENATE(A188,VLOOKUP($I$5,'Цвет мет. опор'!A:B,2,0),\".\",VLOOKUP($K$5,'Цвет столешницы'!A:B,2,FALSE))","v":"EVL843/О/60*30/WHT.L"},null,"4800*1436*750",null,90495]
["EVL844/О/60*30/",{"$f":"CONCATENATE(A189,VLOOKUP($I$5,'Цвет мет. опор'!A:B,2,0),\".\",VLOOKUP($K$5,'Цвет столешницы'!A:B,2,FALSE))","v":"EVL844/О/60*30/WHT.L"},null,"5400*1436*750",null,92626]
[null,null,"Кодировка Артикула стола"]
[null,null,"Модель стола разворот стола /Цвет опор/Цв. заглушки. Цвет столешницы  "]
[null,"МОДЕЛЬ СТОЛА (ФОРМА, РАЗМЕР)","ПРАВОСТОРОННИЙ /ЛЕВОСТОРОННИЙ","ЦВЕТ ОПОР","ЦВЕТ ЗАГЛУШКИ, РУЧЕК","ЦВЕТ СТОЛЕШНИЦЫ"]
[null,null,"SX-левый","АNT-АНТРАЦИТ","АNT-АНТРАЦИТ","H","Белый"]
[null,null,"DX-правый","WHT-БЕЛЫЙ ","H-БЕЛЫЙ ","U727 ","Серый Камень"]
[null,null,null,"GR-СЕРЫЙ","G-СЕРЫЙ","R2","Серый"]
[null,null,null,null,null,"ANT","Антрацит"]
[null,null,null,null,null,"U003","Дуб Честерфилд"]
[null,null,null,null,null,"L","Дуб 131"]

{"sheet":"Столы на П-обр. 40х40","index":5,"n_rows":183,"n_cols":11,"rows_kept":183,"cut":false,"hidden":false,"merged":[[154,1,154,4],[1,8,1,10],[1,6,3,6],[9,4,13,4],[22,4,24,4],[22,2,24,2],[40,4,43,4],[40,2,43,2],[9,2,13,2],[5,2,8,2],[5,4,8,4],[14,2,18,2],[14,4,18,4],[20,2,21,2],[20,4,21,4],[25,2,26,2],[25,4,26,4],[27,2,29,2],[27,4,29,4],[30,2,31,2],[30,4,31,4],[32,2,33,2],[1,1,1,5],[2,1,3,5],[32,4,33,4],[34,2,35,2],[34,4,35,4],[44,2,47,2],[44,4,47,4],[36,2,39,2],[36,4,39,4],[48,2,50,2],[48,4,50,4],[139,4,141,4],[124,2,126,2],[124,4,126,4],[127,2,129,2],[127,4,129,4],[117,1,117,4],[142,2,144,2],[111,4,116,4],[51,2,53,2],[51,4,53,4],[69,2,71,2],[69,4,71,4],[54,2,55,2],[54,4,55,4],[56,2,57,2],[56,4,57,4],[58,2,59,2],[58,4,59,4],[60,2,62,2],[60,4,62,4],[63,4,65,4],[66,2,68,2],[66,4,68,4],[148,2,150,2],[148,4,150,4],[130,2,132,2],[130,4,132,4],[72,4,74,4],[75,2,77,2],[75,4,77,4],[145,2,147,2],[72,2,74,2],[118,2,120,2],[118,4,120,4],[81,2,85,2],[121,4,123,4],[101,2,105,2],[101,4,105,4],[106,2,110,2],[106,4,110,4],[81,4,85,4],[86,2,90,2],[145,4,147,4],[86,4,90,4],[91,2,95,2],[91,4,95,4],[139,2,141,2],[176,5,176,6],[79,4,80,4],[79,2,80,2],[0,8,0,10],[165,2,169,2],[165,4,169,4],[142,4,144,4],[155,2,159,2],[155,4,159,4],[160,2,164,2],[160,4,164,4],[133,2,135,2],[133,4,135,4],[136,2,138,2],[136,4,138,4],[121,2,123,2],[151,2,153,2],[151,4,153,4],[111,2,116,2],[170,2,173,2],[170,4,173,4],[96,2,100,2],[96,4,100,4],[63,2,65,2]]}
[null,"EVOLUTION",null,null,null,{"$f":"Склаская!$F$1","v":"2025-05-23"}]
[null,"Столы, бенчи и рабочие станции на металлокаркасе: П-образные опоры - труба с сечением 40*40мм, траверсы - труба 40*20мм в цв. Антрацит, Белый*  Столешницы ЛДСП - 25 мм.",null,null,null,null,null,null,"Формирование артикула \nв зависимости от выбранных характеристик"]
[null,"Не складская программа производятся на заказ партией от 6 шт., со сроком по согласованию с производством, в цвете: Дуб Честерфилд, Белый, Антрацит, Серый R2, Дуб 131, Серый камень, Венге Цаво, Бетон. Опоры столов в цв. Антрацит, Белый, Серый.\nЗаглушки кабель-каналов и ручки тумб: Антрацит, Белый.\nДля заказа изделия следует пользоваться правилами кодировки для создания  артикула.  →→→→",null,null,null,null,null,null,"в зависимости от выбранных характеристик","Цвет заглушки кабель-канала","Цвет столешницы"]
[null,null,null,null,null,null,null,null,"Антрацит","Антрацит","Дуб 131"]
["Артикул","Артикул","Наименование","Размеры Ш*Г*В (мм)","Изображение","Розничная Цена, руб."]
["EVL113/П/40*40/",{"$f":"CONCATENATE(A6,VLOOKUP($I$4,'Цвет мет. опор'!A:B,2,0),\"/\",VLOOKUP($J$4,'Цвет лючка'!A:B,2,0),\".\",VLOOKUP($K$4,'Цвет столешницы'!A:B,2,FALSE))","v":"EVL113/П/40*40/ANT/ANT.L"},"Стол письменный на П образном м/к 40х40, глубиной 600 мм","1000*600*750",null,17696]
["EVL114/П/40*40/",{"$f":"CONCATENATE(A7,VLOOKUP($I$4,'Цвет мет. опор'!A:B,2,0),\"/\",VLOOKUP($J$4,'Цвет лючка'!A:B,2,0),\".\",VLOOKUP($K$4,'Цвет столешницы'!A:B,2,FALSE))","v":"EVL114/П/40*40/ANT/ANT.L"},null,"1200*600*750",null,18438]
["EVL115/П/40*40/",{"$f":"CONCATENATE(A8,VLOOKUP($I$4,'Цвет мет. опор'!A:B,2,0),\"/\",VLOOKUP($J$4,'Цвет лючка'!A:B,2,0),\".\",VLOOKUP($K$4,'Цвет столешницы'!A:B,2,FALSE))","v":"EVL115/П/40*40/ANT/ANT.L"},null,"1400*600*750",null,18687]
["EVL116/П/40*40/",{"$f":"CONCATENATE(A9,VLOOKUP($I$4,'Цвет мет. опор'!A:B,2,0),\"/\",VLOOKUP($J$4,'Цвет лючка'!A:B,2,0),\".\",VLOOKUP($K$4,'Цвет столешницы'!A:B,2,FALSE))","v":"EVL116/П/40*40/ANT/ANT.L"},null,"1600*600*750",null,19791]
["EVL100/П/40*40/",{"$f":"CONCATENATE(A10,VLOOKUP($I$4,'Цвет мет. опор'!A:B,2,0),\"/\",VLOOKUP($J$4,'Цвет лючка'!A:B,2,0),\".\",VLOOKUP($K$4,'Цвет столешницы'!A:B,2,FALSE))","v":"EVL100/П/40*40/ANT/ANT.L"},"Стол письменный на П образном м/к 40х40, глубиной 700 мм","1000*700*750",null,18348]
["EVL101/П/40*40/",{"$f":"CONCATENATE(A11,VLOOKUP($I$4,'Цвет мет. опор'!A:B,2,0),\"/\",VLOOKUP($J$4,'Цвет лючка'!A:B,2,0),\".\",VLOOKUP($K$4,'Цвет столешницы'!A:B,2,FALSE))","v":"EVL101/П/40*40/ANT/ANT.L"},null,"1200*700*750",null,19213]
["EVL102/П/40*40/",{"$f":"CONCATENATE(A12,VLOOKUP($I$4,'Цвет мет. опор'!A:B,2,0),\"/\",VLOOKUP($J$4,'Цвет лючка'!A:B,2,0),\".\",VLOOKUP($K$4,'Цвет столешницы'!A:B,2,FALSE))","v":"EVL102/П/40*40/ANT/ANT.L"},null,"1400*700*750",null,19890]
["EVL103/П/40*40/",{"$f":"CONCATENATE(A13,VLOOKUP($I$4,'Цвет мет. опор'!A:B,2,0),\"/\",VLOOKUP($J$4,'Цвет лючка'!A:B,2,0),\".\",VLOOKUP($K$4,'Цвет столешницы'!A:B,2,FALSE))","v":"EVL103/П/40*40/ANT/ANT.L"},null,"1600*700*750",null,20337]
["EVL104/П/40*40/",{"$f":"CONCATENATE(A14,VLOOKUP($I$4,'Цвет мет. опор'!A:B,2,0),\"/\",VLOOKUP($J$4,'Цвет лючка'!A:B,2,0),\".\",VLOOKUP($K$4,'Цвет столешницы'!A:B,2,FALSE))","v":"EVL104/П/40*40/ANT/ANT.L"},null,"1800*700*750",null,21381]
["EVL117/П/40*40/",{"$f":"CONCATENATE(A15,VLOOKUP($I$4,'Цвет мет. опор'!A:B,2,0),\"/\",VLOOKUP($J$4,'Цвет лючка'!A:B,2,0),\".\",VLOOKUP($K$4,'Цвет столешницы'!A:B,2,FALSE))","v":"EVL117/П/40*40/ANT/ANT.L"},"Стол письменный на П образном м/к 40х40, глубиной 800 мм","1000*800*750",null,18544]
["EVL118/П/40*40/",{"$f":"CONCATENATE(A16,VLOOKUP($I$4,'Цвет мет. опор'!A:B,2,0),\"/\",VLOOKUP($J$4,'Цвет лючка'!A:B,2,0),\".\",VLOOKUP($K$4,'Цвет столешницы'!A:B,2,FALSE))","v":"EVL118/П/40*40/ANT/ANT.L"},null,"1200*800*750",null,19083]
["EVL119/П/40*40/",{"$f":"CONCATENATE(A17,VLOOKUP($I$4,'Цвет мет. опор'!A:B,2,0),\"/\",VLOOKUP($J$4,'Цвет лючка'!A:B,2,0),\".\",VLOOKUP($K$4,'Цвет столешницы'!A:B,2,FALSE))","v":"EVL119/П/40*40/ANT/ANT.L"},null,"1400*800*750",null,20518]
["EVL120/П/40*40/",{"$f":"CONCATENATE(A18,VLOOKUP($I$4,'Цвет мет. опор'!A:B,2,0),\"/\",VLOOKUP($J$4,'Цвет лючка'!A:B,2,0),\".\",VLOOKUP($K$4,'Цвет столешницы'!A:B,2,FALSE))","v":"EVL120/П/40*40/ANT/ANT.L"},null,"1600*800*750",null,20964]
["EVL121/П/40*40/",{"$f":"CONCATENATE(A19,VLOOKUP($I$4,'Цвет мет. опор'!A:B,2,0),\"/\",VLOOKUP($J$4,'Цвет лючка'!A:B,2,0),\".\",VLOOKUP($K$4,'Цвет столешницы'!A:B,2,FALSE))","v":"EVL121/П/40*40/ANT/ANT.L"},null,"1800*800*750",null,22178]
["EVL122/П/40*40/",{"$f":"CONCATENATE(A20,VLOOKUP($I$4,'Цвет мет. опор'!A:B,2,0),\"/\",VLOOKUP($J$4,'Цвет лючка'!A:B,2,0),\".\",VLOOKUP($K$4,'Цвет столешницы'!A:B,2,FALSE))","v":"EVL122/П/40*40/ANT/ANT.L"},"Стол письменный на П образном м/к 40х40, глубиной 900 мм","1800*900*750",null,22433]
["EVL123/П/40*40/",{"$f":"CONCATENATE(A21,VLOOKUP($I$4,'Цвет мет. опор'!A:B,2,0),\"/\",VLOOKUP($J$4,'Цвет лючка'!A:B,2,0),\".\",VLOOKUP($K$4,'Цвет столешницы'!A:B,2,FALSE))","v":"EVL123/П/40*40/ANT/ANT.L"},"Стол криволинейный левый/правый на П образном м/к 40х40, глубиной 600/900 мм","1200*900*750","правый",19108]
["EVL124/П/40*40/",{"$f":"CONCATENATE(A22,VLOOKUP($I$4,'Цвет мет. опор'!A:B,2,0),\"/\",VLOOKUP($J$4,'Цвет лючка'!A:B,2,0),\".\",VLOOKUP($K$4,'Цвет столешницы'!A:B,2,FALSE))","v":"EVL124/П/40*40/ANT/ANT.L"},null,"1400*900*750",null,20184]
["EVL105SX(DX)/П/40*40/",{"$f":"CONCATENATE(A23,VLOOKUP($I$4,'Цвет мет. опор'!A:B,2,0),\"/\",VLOOKUP($J$4,'Цвет лючка'!A:B,2,0),\".\",VLOOKUP($K$4,'Цвет столешницы'!A:B,2,FALSE))","v":"EVL105SX(DX)/П/40*40/ANT/ANT.L"},"Стол криволинейный левый/правый на П образном м/к 40х40, глубиной 700/900 мм","1200*900*750","правый",19238]
["EVL106SX(DX)/П/40*40/",{"$f":"CONCATENATE(A24,VLOOKUP($I$4,'Цвет мет. опор'!A:B,2,0),\"/\",VLOOKUP($J$4,'Цвет лючка'!A:B,2,0),\".\",VLOOKUP($K$4,'Цвет столешницы'!A:B,2,FALSE))","v":"EVL106SX(DX)/П/40*40/ANT/ANT.L"},null,"1400*900*750",null,20315]
["EVL107SX(DX)/П/40*40/",{"$f":"CONCATENATE(A25,VLOOKUP($I$4,'Цвет мет. опор'!A:B,2,0),\"/\",VLOOKUP($J$4,'Цвет лючка'!A:B,2,0),\".\",VLOOKUP($K$4,'Цвет столешницы'!A:B,2,FALSE))","v":"EVL107SX(DX)/П/40*40/ANT/ANT.L"},null,"1600*900*750",null,20737]
["EVL125SX(DX)/П/40*40/",{"$f":"CONCATENATE(A26,VLOOKUP($I$4,'Цвет мет. опор'!A:B,2,0),\"/\",VLOOKUP($J$4,'Цвет лючка'!A:B,2,0),\".\",VLOOKUP($K$4,'Цвет столешницы'!A:B,2,FALSE))","v":"EVL125SX(DX)/П/40*40/ANT/ANT.L"},"Стол криволинейный левый/правый на П образном м/к 40х40, глубиной 800/900 мм","1400*900*750",null,16423]
["EVL126SX(DX)/П/40*40/",{"$f":"CONCATENATE(A27,VLOOKUP($I$4,'Цвет мет. опор'!A:B,2,0),\"/\",VLOOKUP($J$4,'Цвет лючка'!A:B,2,0),\".\",VLOOKUP($K$4,'Цвет столешницы'!A:B,2,FALSE))","v":"EVL126SX(DX)/П/40*40/ANT/ANT.L"},null,"1600*900*750",null,21220]
["EVL109SX(DX)/П/40*40",{"$f":"CONCATENATE(A28,VLOOKUP($I$4,'Цвет мет. опор'!A:B,2,0),\"/\",VLOOKUP($J$4,'Цвет лючка'!A:B,2,0),\".\",VLOOKUP($K$4,'Цвет столешницы'!A:B,2,FALSE))","v":"EVL109SX(DX)/П/40*40ANT/ANT.L"},"Стол эргономичный левый/правый на П образном м/к 40х40, глубиной 700/900 мм","1200х900/700х750",null,19216]
["EVL110SX(DX)/П/40*40",{"$f":"CONCATENATE(A29,VLOOKUP($I$4,'Цвет мет. опор'!A:B,2,0),\"/\",VLOOKUP($J$4,'Цвет лючка'!A:B,2,0),\".\",VLOOKUP($K$4,'Цвет столешницы'!A:B,2,FALSE))","v":"EVL110SX(DX)/П/40*40ANT/ANT.L"},null,"1400х900/700х750",null,20020]
["EVL111SX(DX)/П/40*40",{"$f":"CONCATENATE(A30,VLOOKUP($I$4,'Цвет мет. опор'!A:B,2,0),\"/\",VLOOKUP($J$4,'Цвет лючка'!A:B,2,0),\".\",VLOOKUP($K$4,'Цвет столешницы'!A:B,2,FALSE))","v":"EVL111SX(DX)/П/40*40ANT/ANT.L"},null,"1600х900/700х750",null,20753]
["EVL127SX(DX)/П/40*40/",{"$f":"CONCATENATE(A31,VLOOKUP($I$4,'Цвет мет. опор'!A:B,2,0),\"/\",VLOOKUP($J$4,'Цвет лючка'!A:B,2,0),\".\",VLOOKUP($K$4,'Цвет столешницы'!A:B,2,FALSE))","v":"EVL127SX(DX)/П/40*40/ANT/ANT.L"},"Стол эргономичный левый/правый на П образном м/к 40х40, глубиной 600/1200 мм","1400*1200*750",null,30648]
["EVL128SX(DX)/П/40*40/",{"$f":"CONCATENATE(A32,VLOOKUP($I$4,'Цвет мет. опор'!A:B,2,0),\"/\",VLOOKUP($J$4,'Цвет лючка'!A:B,2,0),\".\",VLOOKUP($K$4,'Цвет столешницы'!A:B,2,FALSE))","v":"EVL128SX(DX)/П/40*40/ANT/ANT.L"},null,"1600*1200*750",null,31547]
["EVL129SX(DX)/П/40*40/",{"$f":"CONCATENATE(A33,VLOOKUP($I$4,'Цвет мет. опор'!A:B,2,0),\"/\",VLOOKUP($J$4,'Цвет лючка'!A:B,2,0),\".\",VLOOKUP($K$4,'Цвет столешницы'!A:B,2,FALSE))","v":"EVL129SX(DX)/П/40*40/ANT/ANT.L"},"Стол эргономичный левый/правый на П образном м/к 40х40, глубиной 700/1200 мм","1400*1200*750",null,30999]
["EVL130SX(DX)/П/40*40/",{"$f":"CONCATENATE(A34,VLOOKUP($I$4,'Цвет мет. опор'!A:B,2,0),\"/\",VLOOKUP($J$4,'Цвет лючка'!A:B,2,0),\".\",VLOOKUP($K$4,'Цвет столешницы'!A:B,2,FALSE))","v":"EVL130SX(DX)/П/40*40/ANT/ANT.L"},null,"1600*1200*750",null,31890]
["EVL131SX(DX)/П/40*40/",{"$f":"CONCATENATE(A35,VLOOKUP($I$4,'Цвет мет. опор'!A:B,2,0),\"/\",VLOOKUP($J$4,'Цвет лючка'!A:B,2,0),\".\",VLOOKUP($K$4,'Цвет столешницы'!A:B,2,FALSE))","v":"EVL131SX(DX)/П/40*40/ANT/ANT.L"},"Стол эргономичный левый/правый на П образном м/к 40х40, глубиной 800/1200 мм","1400*1200*750",null,31270]
["EVL132SX(DX)/П/40*40/",{"$f":"CONCATENATE(A36,VLOOKUP($I$4,'Цвет мет. опор'!A:B,2,0),\"/\",VLOOKUP($J$4,'Цвет лючка'!A:B,2,0),\".\",VLOOKUP($K$4,'Цвет столешницы'!A:B,2,FALSE))","v":"EVL132SX(DX)/П/40*40/ANT/ANT.L"},null,"1600*1200*750",null,31563]
["EVL601/П/40*40/",{"$f":"CONCATENATE(A37,VLOOKUP($I$4,'Цвет мет. опор'!A:B,2,0),\"/\",VLOOKUP($J$4,'Цвет лючка'!A:B,2,0),\".\",VLOOKUP($K$4,'Цвет столешницы'!A:B,2,FALSE))","v":"EVL601/П/40*40/ANT/ANT.L"},"Рабочая станция на П образном м/к 40х40, глубиной 1236 мм","1200*1236*750",null,31553]
["EVL602/П/40*40/",{"$f":"CONCATENATE(A38,VLOOKUP($I$4,'Цвет мет. опор'!A:B,2,0),\"/\",VLOOKUP($J$4,'Цвет лючка'!A:B,2,0),\".\",VLOOKUP($K$4,'Цвет столешницы'!A:B,2,FALSE))","v":"EVL602/П/40*40/ANT/ANT.L"},null,"1400*1236*750",null,32502]
["EVL603/П/40*40/",{"$f":"CONCATENATE(A39,VLOOKUP($I$4,'Цвет мет. опор'!A:B,2,0),\"/\",VLOOKUP($J$4,'Цвет лючка'!A:B,2,0),\".\",VLOOKUP($K$4,'Цвет столешницы'!A:B,2,FALSE))","v":"EVL603/П/40*40/ANT/ANT.L"},null,"1600*1236*750",null,34258]
["EVL681/П/40*40/",{"$f":"CONCATENATE(A40,VLOOKUP($I$4,'Цвет мет. опор'!A:B,2,0),\"/\",VLOOKUP($J$4,'Цвет лючка'!A:B,2,0),\".\",VLOOKUP($K$4,'Цвет столешницы'!A:B,2,FALSE))","v":"EVL681/П/40*40/ANT/ANT.L"},null,"1800*1236*750",null,35957]
["EVL604/П/40*40/",{"$f":"CONCATENATE(A41,VLOOKUP($I$4,'Цвет мет. опор'!A:B,2,0),\"/\",VLOOKUP($J$4,'Цвет лючка'!A:B,2,0),\".\",VLOOKUP($K$4,'Цвет столешницы'!A:B,2,FALSE))","v":"EVL604/П/40*40/ANT/ANT.L"},"Рабочая станция на П образном м/к 40х40 глубиной 1436","1200*1436*750",null,33014]
["EVL605/П/40*40/",{"$f":"CONCATENATE(A42,VLOOKUP($I$4,'Цвет мет. опор'!A:B,2,0),\"/\",VLOOKUP($J$4,'Цвет лючка'!A:B,2,0),\".\",VLOOKUP($K$4,'Цвет столешницы'!A:B,2,FALSE))","v":"EVL605/П/40*40/ANT/ANT.L"},null,"1400*1436*750",null,34108]
["EVL606/П/40*40/",{"$f":"CONCATENATE(A43,VLOOKUP($I$4,'Цвет мет. опор'!A:B,2,0),\"/\",VLOOKUP($J$4,'Цвет лючка'!A:B,2,0),\".\",VLOOKUP($K$4,'Цвет столешницы'!A:B,2,FALSE))","v":"EVL606/П/40*40/ANT/ANT.L"},null,"1600*1436*750",null,35813]
["EVL682/П/40*40/",{"$f":"CONCATENATE(A44,VLOOKUP($I$4,'Цвет мет. опор'!A:B,2,0),\"/\",VLOOKUP($J$4,'Цвет лючка'!A:B,2,0),\".\",VLOOKUP($K$4,'Цвет столешницы'!A:B,2,FALSE))","v":"EVL682/П/40*40/ANT/ANT.L"},null,"1800*1436*750",null,37350]
["EVL607/П/40*40/",{"$f":"CONCATENATE(A45,VLOOKUP($I$4,'Цвет мет. опор'!A:B,2,0),\"/\",VLOOKUP($J$4,'Цвет лючка'!A:B,2,0),\".\",VLOOKUP($K$4,'Цвет столешницы'!A:B,2,FALSE))","v":"EVL607/П/40*40/ANT/ANT.L"},"Рабочая станция на П образном м/к 40х40 глубиной 1636","1200*1636*750",null,34223]
["EVL608/П/40*40/",{"$f":"CONCATENATE(A46,VLOOKUP($I$4,'Цвет мет. опор'!A:B,2,0),\"/\",VLOOKUP($J$4,'Цвет лючка'!A:B,2,0),\".\",VLOOKUP($K$4,'Цвет столешницы'!A:B,2,FALSE))","v":"EVL608/П/40*40/ANT/ANT.L"},null,"1400*1636*750",null,35986]
["EVL609/П/40*40/",{"$f":"CONCATENATE(A47,VLOOKUP($I$4,'Цвет мет. опор'!A:B,2,0),\"/\",VLOOKUP($J$4,'Цвет лючка'!A:B,2,0),\".\",VLOOKUP($K$4,'Цвет столешницы'!A:B,2,FALSE))","v":"EVL609/П/40*40/ANT/ANT.L"},null,"1600*1636*750",null,36857]
["EVL683/П/40*40/",{"$f":"CONCATENATE(A48,VLOOKUP($I$4,'Цвет мет. опор'!A:B,2,0),\"/\",VLOOKUP($J$4,'Цвет лючка'!A:B,2,0),\".\",VLOOKUP($K$4,'Цвет столешницы'!A:B,2,FALSE))","v":"EVL683/П/40*40/ANT/ANT.L"},null,"1800*1636*750",null,39289]
["EVL610/П/40*40/",{"$f":"CONCATENATE(A49,VLOOKUP($I$4,'Цвет мет. опор'!A:B,2,0),\"/\",VLOOKUP($J$4,'Цвет лючка'!A:B,2,0),\".\",VLOOKUP($K$4,'Цвет столешницы'!A:B,2,FALSE))","v":"EVL610/П/40*40/ANT/ANT.L"},"Рабочая станция криволинейная на П образном м/к 40х40 глубиной 1236/1836","1200*1836*750",null,34055]
["EVL611/П/40*40/",{"$f":"CONCATENATE(A50,VLOOKUP($I$4,'Цвет мет. опор'!A:B,2,0),\"/\",VLOOKUP($J$4,'Цвет лючка'!A:B,2,0),\".\",VLOOKUP($K$4,'Цвет столешницы'!A:B,2,FALSE))","v":"EVL611/П/40*40/ANT/ANT.L"},null,"1400*1836*750",null,35938]
["EVL612/П/40*40/",{"$f":"CONCATENATE(A51,VLOOKUP($I$4,'Цвет мет. опор'!A:B,2,0),\"/\",VLOOKUP($J$4,'Цвет лючка'!A:B,2,0),\".\",VLOOKUP($K$4,'Цвет столешницы'!A:B,2,FALSE))","v":"EVL612/П/40*40/ANT/ANT.L"},null,"1600*1836*750",null,37357]
["EVL613/П/40*40/",{"$f":"CONCATENATE(A52,VLOOKUP($I$4,'Цвет мет. опор'!A:B,2,0),\"/\",VLOOKUP($J$4,'Цвет лючка'!A:B,2,0),\".\",VLOOKUP($K$4,'Цвет столешницы'!A:B,2,FALSE))","v":"EVL613/П/40*40/ANT/ANT.L"},"Рабочая станция криволинейная \nна П образном м/к 40х40 глубиной 1436/1836","1200*1836*750",null,33066]
["EVL614/П/40*40/",{"$f":"CONCATENATE(A53,VLOOKUP($I$4,'Цвет мет. опор'!A:B,2,0),\"/\",VLOOKUP($J$4,'Цвет лючка'!A:B,2,0),\".\",VLOOKUP($K$4,'Цвет столешницы'!A:B,2,FALSE))","v":"EVL614/П/40*40/ANT/ANT.L"},null,"1400*1836*750",null,35218]
["EVL615/П/40*40/",{"$f":"CONCATENATE(A54,VLOOKUP($I$4,'Цвет мет. опор'!A:B,2,0),\"/\",VLOOKUP($J$4,'Цвет лючка'!A:B,2,0),\".\",VLOOKUP($K$4,'Цвет столешницы'!A:B,2,FALSE))","v":"EVL615/П/40*40/ANT/ANT.L"},null,"1600*1836*750",null,35967]
["EVL616/П/40*40/",{"$f":"CONCATENATE(A55,VLOOKUP($I$4,'Цвет мет. опор'!A:B,2,0),\"/\",VLOOKUP($J$4,'Цвет лючка'!A:B,2,0),\".\",VLOOKUP($K$4,'Цвет столешницы'!A:B,2,FALSE))","v":"EVL616/П/40*40/ANT/ANT.L"},"Рабочая станция эргономичная на \nП образном м/к 40х40 глубиной 1236/2436","1400*2436*750",null,55849]
["EVL617/П/40*40/",{"$f":"CONCATENATE(A56,VLOOKUP($I$4,'Цвет мет. опор'!A:B,2,0),\"/\",VLOOKUP($J$4,'Цвет лючка'!A:B,2,0),\".\",VLOOKUP($K$4,'Цвет столешницы'!A:B,2,FALSE))","v":"EVL617/П/40*40/ANT/ANT.L"},null,"1600*2436*750",null,57713]
["EVL618/П/40*40/",{"$f":"CONCATENATE(A57,VLOOKUP($I$4,'Цвет мет. опор'!A:B,2,0),\"/\",VLOOKUP($J$4,'Цвет лючка'!A:B,2,0),\".\",VLOOKUP($K$4,'Цвет столешницы'!A:B,2,FALSE))","v":"EVL618/П/40*40/ANT/ANT.L"},"Рабочая станция эргономичная на \nП образном м/к 40х40 глубиной 1436/2436","1400*2436*750",null,56882]
["EVL619/П/40*40/",{"$f":"CONCATENATE(A58,VLOOKUP($I$4,'Цвет мет. опор'!A:B,2,0),\"/\",VLOOKUP($J$4,'Цвет лючка'!A:B,2,0),\".\",VLOOKUP($K$4,'Цвет столешницы'!A:B,2,FALSE))","v":"EVL619/П/40*40/ANT/ANT.L"},null,"1600*2436*750",null,58797]
["EVL620/П/40*40/",{"$f":"CONCATENATE(A59,VLOOKUP($I$4,'Цвет мет. опор'!A:B,2,0),\"/\",VLOOKUP($J$4,'Цвет лючка'!A:B,2,0),\".\",VLOOKUP($K$4,'Цвет столешницы'!A:B,2,FALSE))","v":"EVL620/П/40*40/ANT/ANT.L"},"Рабочая станция эргономичная на \n П образном м/к 40х40 глубиной 1636/2436","1400*2440*750",null,57343]
["EVL621/П/40*40/",{"$f":"CONCATENATE(A60,VLOOKUP($I$4,'Цвет мет. опор'!A:B,2,0),\"/\",VLOOKUP($J$4,'Цвет лючка'!A:B,2,0),\".\",VLOOKUP($K$4,'Цвет столешницы'!A:B,2,FALSE))","v":"EVL621/П/40*40/ANT/ANT.L"},null,"1600*2440*750",null,59041]
["EVL622/П/40*40/",{"$f":"CONCATENATE(A61,VLOOKUP($I$4,'Цвет мет. опор'!A:B,2,0),\"/\",VLOOKUP($J$4,'Цвет лючка'!A:B,2,0),\".\",VLOOKUP($K$4,'Цвет столешницы'!A:B,2,FALSE))","v":"EVL622/П/40*40/ANT/ANT.L"},"Рабочая станция эргономичная на \nП образном м/к 40х40 \nглубиной 600/900","2400*900*750",null,37025]
["EVL623/П/40*40/",{"$f":"CONCATENATE(A62,VLOOKUP($I$4,'Цвет мет. опор'!A:B,2,0),\"/\",VLOOKUP($J$4,'Цвет лючка'!A:B,2,0),\".\",VLOOKUP($K$4,'Цвет столешницы'!A:B,2,FALSE))","v":"EVL623/П/40*40/ANT/ANT.L"},null,"2800*900*750",null,38908]
["EVL624/П/40*40/",{"$f":"CONCATENATE(A63,VLOOKUP($I$4,'Цвет мет. опор'!A:B,2,0),\"/\",VLOOKUP($J$4,'Цвет лючка'!A:B,2,0),\".\",VLOOKUP($K$4,'Цвет столешницы'!A:B,2,FALSE))","v":"EVL624/П/40*40/ANT/ANT.L"},null,"3200*900*750",null,40327]
["EVL625/П/40*40/",{"$f":"CONCATENATE(A64,VLOOKUP($I$4,'Цвет мет. опор'!A:B,2,0),\"/\",VLOOKUP($J$4,'Цвет лючка'!A:B,2,0),\".\",VLOOKUP($K$4,'Цвет столешницы'!A:B,2,FALSE))","v":"EVL625/П/40*40/ANT/ANT.L"},"Рабочая станция эргономичная \nна П образном м/к 40х40 \nглубиной 700/900","2400*900*750",null,36116]
["EVL626/П/40*40/",{"$f":"CONCATENATE(A65,VLOOKUP($I$4,'Цвет мет. опор'!A:B,2,0),\"/\",VLOOKUP($J$4,'Цвет лючка'!A:B,2,0),\".\",VLOOKUP($K$4,'Цвет столешницы'!A:B,2,FALSE))","v":"EVL626/П/40*40/ANT/ANT.L"},null,"2800*900*750",null,38268]
["EVL627/П/40*40/",{"$f":"CONCATENATE(A66,VLOOKUP($I$4,'Цвет мет. опор'!A:B,2,0),\"/\",VLOOKUP($J$4,'Цвет лючка'!A:B,2,0),\".\",VLOOKUP($K$4,'Цвет столешницы'!A:B,2,FALSE))","v":"EVL627/П/40*40/ANT/ANT.L"},null,"3200*900*750",null,39663]
["EVL628/П/40*40/",{"$f":"CONCATENATE(A67,VLOOKUP($I$4,'Цвет мет. опор'!A:B,2,0),\"/\",VLOOKUP($J$4,'Цвет лючка'!A:B,2,0),\".\",VLOOKUP($K$4,'Цвет столешницы'!A:B,2,FALSE))","v":"EVL628/П/40*40/ANT/ANT.L"},"Рабочая станция эргономичная на \nП образном м/к 40х40 \nглубиной 800/900","2400*900*750",null,37633]
["EVL629/П/40*40/",{"$f":"CONCATENATE(A68,VLOOKUP($I$4,'Цвет мет. опор'!A:B,2,0),\"/\",VLOOKUP($J$4,'Цвет лючка'!A:B,2,0),\".\",VLOOKUP($K$4,'Цвет столешницы'!A:B,2,FALSE))","v":"EVL629/П/40*40/ANT/ANT.L"},null,"2800*900*750",null,39470]
["EVL630/П/40*40/",{"$f":"CONCATENATE(A69,VLOOKUP($I$4,'Цвет мет. опор'!A:B,2,0),\"/\",VLOOKUP($J$4,'Цвет лючка'!A:B,2,0),\".\",VLOOKUP($K$4,'Цвет столешницы'!A:B,2,FALSE))","v":"EVL630/П/40*40/ANT/ANT.L"},null,"3200*900*750",null,40862]
["EVL631/П/40*40/",{"$f":"CONCATENATE(A70,VLOOKUP($I$4,'Цвет мет. опор'!A:B,2,0),\"/\",VLOOKUP($J$4,'Цвет лючка'!A:B,2,0),\".\",VLOOKUP($K$4,'Цвет столешницы'!A:B,2,FALSE))","v":"EVL631/П/40*40/ANT/ANT.L"},"Рабочая станция эргономичная на \nП образном м/к 40х40 \nглубиной 600/1200","2400*1236*750","промежуточная опора 1236",39406]
["EVL632/П/40*40/",{"$f":"CONCATENATE(A71,VLOOKUP($I$4,'Цвет мет. опор'!A:B,2,0),\"/\",VLOOKUP($J$4,'Цвет лючка'!A:B,2,0),\".\",VLOOKUP($K$4,'Цвет столешницы'!A:B,2,FALSE))","v":"EVL632/П/40*40/ANT/ANT.L"},null,"2800*1236*750",null,41389]
["EVL633/П/40*40/",{"$f":"CONCATENATE(A72,VLOOKUP($I$4,'Цвет мет. опор'!A:B,2,0),\"/\",VLOOKUP($J$4,'Цвет лючка'!A:B,2,0),\".\",VLOOKUP($K$4,'Цвет столешницы'!A:B,2,FALSE))","v":"EVL633/П/40*40/ANT/ANT.L"},null,"3200*1236*750",null,43186]
["EVL634/П/40*40/",{"$f":"CONCATENATE(A73,VLOOKUP($I$4,'Цвет мет. опор'!A:B,2,0),\"/\",VLOOKUP($J$4,'Цвет лючка'!A:B,2,0),\".\",VLOOKUP($K$4,'Цвет столешницы'!A:B,2,FALSE))","v":"EVL634/П/40*40/ANT/ANT.L"},"Рабочая станция эргономичная на \nП образном м/к 40х40 \nглубиной 700/1200","2400*1200*750","промежуточная опора 700",40101]
["EVL635/П/40*40/",{"$f":"CONCATENATE(A74,VLOOKUP($I$4,'Цвет мет. опор'!A:B,2,0),\"/\",VLOOKUP($J$4,'Цвет лючка'!A:B,2,0),\".\",VLOOKUP($K$4,'Цвет столешницы'!A:B,2,FALSE))","v":"EVL635/П/40*40/ANT/ANT.L"},null,"2800*1200*750",null,42391]
["EVL636/П/40*40/",{"$f":"CONCATENATE(A75,VLOOKUP($I$4,'Цвет мет. опор'!A:B,2,0),\"/\",VLOOKUP($J$4,'Цвет лючка'!A:B,2,0),\".\",VLOOKUP($K$4,'Цвет столешницы'!A:B,2,FALSE))","v":"EVL636/П/40*40/ANT/ANT.L"},null,"3200*1200*750",null,44173]
["EVL637/П/40*40/",{"$f":"CONCATENATE(A76,VLOOKUP($I$4,'Цвет мет. опор'!A:B,2,0),\"/\",VLOOKUP($J$4,'Цвет лючка'!A:B,2,0),\".\",VLOOKUP($K$4,'Цвет столешницы'!A:B,2,FALSE))","v":"EVL637/П/40*40/ANT/ANT.L"},"Рабочая станция эргономичная на \nП образном м/к 40х40 \nглубиной 800/1200","2400*1200*750","промежуточная опора 800",40255]
["EVL638/П/40*40/",{"$f":"CONCATENATE(A77,VLOOKUP($I$4,'Цвет мет. опор'!A:B,2,0),\"/\",VLOOKUP($J$4,'Цвет лючка'!A:B,2,0),\".\",VLOOKUP($K$4,'Цвет столешницы'!A:B,2,FALSE))","v":"EVL638/П/40*40/ANT/ANT.L"},null,"2800*1200*750",null,42677]
["EVL639/П/40*40/",{"$f":"CONCATENATE(A78,VLOOKUP($I$4,'Цвет мет. опор'!A:B,2,0),\"/\",VLOOKUP($J$4,'Цвет лючка'!A:B,2,0),\".\",VLOOKUP($K$4,'Цвет столешницы'!A:B,2,FALSE))","v":"EVL639/П/40*40/ANT/ANT.L"},null,"3200*1200*750",null,44309]
["EVL180/П/40*40/",{"$f":"CONCATENATE(A79,VLOOKUP($I$4,'Цвет мет. опор'!A:B,2,0),\"/\",VLOOKUP($J$4,'Цвет лючка'!A:B,2,0),\".\",VLOOKUP($K$4,'Цвет столешницы'!A:B,2,FALSE))","v":"EVL180/П/40*40/ANT/ANT.L"},"Приставка к столу рабочая 1000х500","1000x500x750",null,12418]
["EVL135/П/40*40/",{"$f":"CONCATENATE(A80,VLOOKUP($I$4,'Цвет мет. опор'!A:B,2,0),\"/\",VLOOKUP($J$4,'Цвет лючка'!A:B,2,0),\".\",VLOOKUP($K$4,'Цвет столешницы'!A:B,2,FALSE))","v":"EVL135/П/40*40/ANT/ANT.L"},"Приставной элемент на \n П образном м/к 40х40 \nглубиной 700 (используется в качестве брифинга)","1000*600*750",null,13733]
["EVL137/П/40*40/",{"$f":"CONCATENATE(A81,VLOOKUP($I$4,'Цвет мет. опор'!A:B,2,0),\"/\",VLOOKUP($J$4,'Цвет лючка'!A:B,2,0),\".\",VLOOKUP($K$4,'Цвет столешницы'!A:B,2,FALSE))","v":"EVL137/П/40*40/ANT/ANT.L"},null,"1200*700*750",null,14337]
["EVL701/П/40*40/",{"$f":"CONCATENATE(A82,VLOOKUP($I$4,'Цвет мет. опор'!A:B,2,0),\"/\",VLOOKUP($J$4,'Цвет лючка'!A:B,2,0),\".\",VLOOKUP($K$4,'Цвет столешницы'!A:B,2,FALSE))","v":"EVL701/П/40*40/ANT/ANT.L"},"Рабочая станция на П образном м/к 40х40 с тумбой \n(композиция стол+тумба)","1450*700*750","Тумба 450х700х750",33567]
["EVL702/П/40*40/",{"$f":"CONCATENATE(A83,VLOOKUP($I$4,'Цвет мет. опор'!A:B,2,0),\"/\",VLOOKUP($J$4,'Цвет лючка'!A:B,2,0),\".\",VLOOKUP($K$4,'Цвет столешницы'!A:B,2,FALSE))","v":"EVL702/П/40*40/ANT/ANT.L"},null,"1650*700*750",null,34431]
["EVL703/П/40*40/",{"$f":"CONCATENATE(A84,VLOOKUP($I$4,'Цвет мет. опор'!A:B,2,0),\"/\",VLOOKUP($J$4,'Цвет лючка'!A:B,2,0),\".\",VLOOKUP($K$4,'Цвет столешницы'!A:B,2,FALSE))","v":"EVL703/П/40*40/ANT/ANT.L"},null,"1850*700*750",null,35109]
["EVL704/П/40*40/",{"$f":"CONCATENATE(A85,VLOOKUP($I$4,'Цвет мет. опор'!A:B,2,0),\"/\",VLOOKUP($J$4,'Цвет лючка'!A:B,2,0),\".\",VLOOKUP($K$4,'Цвет столешницы'!A:B,2,FALSE))","v":"EVL704/П/40*40/ANT/ANT.L"},null,"2050*700*750",null,35555]
["EVL705/П/40*40/",{"$f":"CONCATENATE(A86,VLOOKUP($I$4,'Цвет мет. опор'!A:B,2,0),\"/\",VLOOKUP($J$4,'Цвет лючка'!A:B,2,0),\".\",VLOOKUP($K$4,'Цвет столешницы'!A:B,2,FALSE))","v":"EVL705/П/40*40/ANT/ANT.L"},null,"2250*700*750",null,36599]
["EVL706/П/40*40/",{"$f":"CONCATENATE(A87,VLOOKUP($I$4,'Цвет мет. опор'!A:B,2,0),\"/\",VLOOKUP($J$4,'Цвет лючка'!A:B,2,0),\".\",VLOOKUP($K$4,'Цвет столешницы'!A:B,2,FALSE))","v":"EVL706/П/40*40/ANT/ANT.L"},"Рабочая станция на П образном м/к 40х40 с тумбой \n(композиция двойной бенч+тумба)","1450*1436*750","Тумба  450х1436х750",57845]
["EVL707/П/40*40/",{"$f":"CONCATENATE(A88,VLOOKUP($I$4,'Цвет мет. опор'!A:B,2,0),\"/\",VLOOKUP($J$4,'Цвет лючка'!A:B,2,0),\".\",VLOOKUP($K$4,'Цвет столешницы'!A:B,2,FALSE))","v":"EVL707/П/40*40/ANT/ANT.L"},null,"1650*1436*750",null,59574]
["EVL708/П/40*40/",{"$f":"CONCATENATE(A89,VLOOKUP($I$4,'Цвет мет. опор'!A:B,2,0),\"/\",VLOOKUP($J$4,'Цвет лючка'!A:B,2,0),\".\",VLOOKUP($K$4,'Цвет столешницы'!A:B,2,FALSE))","v":"EVL708/П/40*40/ANT/ANT.L"},null,"1850*1436*750",null,61092]
["EVL709/П/40*40/",{"$f":"CONCATENATE(A90,VLOOKUP($I$4,'Цвет мет. опор'!A:B,2,0),\"/\",VLOOKUP($J$4,'Цвет лючка'!A:B,2,0),\".\",VLOOKUP($K$4,'Цвет столешницы'!A:B,2,FALSE))","v":"EVL709/П/40*40/ANT/ANT.L"},null,"2050*1436*750",null,62373]
["EVL710/П/40*40/",{"$f":"CONCATENATE(A91,VLOOKUP($I$4,'Цвет мет. опор'!A:B,2,0),\"/\",VLOOKUP($J$4,'Цвет лючка'!A:B,2,0),\".\",VLOOKUP($K$4,'Цвет столешницы'!A:B,2,FALSE))","v":"EVL710/П/40*40/ANT/ANT.L"},null,"2250*1436*750",null,63911]
["EVL711/П/40*40/",{"$f":"CONCATENATE(A92,VLOOKUP($I$4,'Цвет мет. опор'!A:B,2,0),\"/\",VLOOKUP($J$4,'Цвет лючка'!A:B,2,0),\".\",VLOOKUP($K$4,'Цвет столешницы'!A:B,2,FALSE))","v":"EVL711/П/40*40/ANT/ANT.L"},"Рабочая станция на П образном м/к 40х40 со шкафом-купе\n(композиция двойной бенч+шкаф-купе)","1410*1436*750","Шкаф-купе приставной  1440х410х750",51749]
["EVL712/П/40*40/",{"$f":"CONCATENATE(A93,VLOOKUP($I$4,'Цвет мет. опор'!A:B,2,0),\"/\",VLOOKUP($J$4,'Цвет лючка'!A:B,2,0),\".\",VLOOKUP($K$4,'Цвет столешницы'!A:B,2,FALSE))","v":"EVL712/П/40*40/ANT/ANT.L"},null,"1610*1436*750",null,53478]
["EVL713/П/40*40/",{"$f":"CONCATENATE(A94,VLOOKUP($I$4,'Цвет мет. опор'!A:B,2,0),\"/\",VLOOKUP($J$4,'Цвет лючка'!A:B,2,0),\".\",VLOOKUP($K$4,'Цвет столешницы'!A:B,2,FALSE))","v":"EVL713/П/40*40/ANT/ANT.L"},null,"1810*1436*750",null,54572]
["EVL714/П/40*40/",{"$f":"CONCATENATE(A95,VLOOKUP($I$4,'Цвет мет. опор'!A:B,2,0),\"/\",VLOOKUP($J$4,'Цвет лючка'!A:B,2,0),\".\",VLOOKUP($K$4,'Цвет столешницы'!A:B,2,FALSE))","v":"EVL714/П/40*40/ANT/ANT.L"},null,"2010*1436*750",null,56277]
["EVL715/П/40*40/",{"$f":"CONCATENATE(A96,VLOOKUP($I$4,'Цвет мет. опор'!A:B,2,0),\"/\",VLOOKUP($J$4,'Цвет лючка'!A:B,2,0),\".\",VLOOKUP($K$4,'Цвет столешницы'!A:B,2,FALSE))","v":"EVL715/П/40*40/ANT/ANT.L"},null,"2210*1436*750",null,57815]
["EVL716/П/40*40/",{"$f":"CONCATENATE(A97,VLOOKUP($I$4,'Цвет мет. опор'!A:B,2,0),\"/\",VLOOKUP($J$4,'Цвет лючка'!A:B,2,0),\".\",VLOOKUP($K$4,'Цвет столешницы'!A:B,2,FALSE))","v":"EVL716/П/40*40/ANT/ANT.L"},"Рабочая станция на П образном м/к 40х40 со шкафом-купе\n(композиция двойной бенч+шкаф-купе)","1410*1436*1098","Шкаф-купе приставной 1440х410х1098",56611]
["EVL717/П/40*40/",{"$f":"CONCATENATE(A98,VLOOKUP($I$4,'Цвет мет. опор'!A:B,2,0),\"/\",VLOOKUP($J$4,'Цвет лючка'!A:B,2,0),\".\",VLOOKUP($K$4,'Цвет столешницы'!A:B,2,FALSE))","v":"EVL717/П/40*40/ANT/ANT.L"},null,"1610*1436*1098",null,58340]
["EVL718/П/40*40/",{"$f":"CONCATENATE(A99,VLOOKUP($I$4,'Цвет мет. опор'!A:B,2,0),\"/\",VLOOKUP($J$4,'Цвет лючка'!A:B,2,0),\".\",VLOOKUP($K$4,'Цвет столешницы'!A:B,2,FALSE))","v":"EVL718/П/40*40/ANT/ANT.L"},null,"1810*1436*1098",null,59434]
["EVL719/П/40*40/",{"$f":"CONCATENATE(A100,VLOOKUP($I$4,'Цвет мет. опор'!A:B,2,0),\"/\",VLOOKUP($J$4,'Цвет лючка'!A:B,2,0),\".\",VLOOKUP($K$4,'Цвет столешницы'!A:B,2,FALSE))","v":"EVL719/П/40*40/ANT/ANT.L"},null,"2010*1436*1098",null,61139]
["EVL720/П/40*40/",{"$f":"CONCATENATE(A101,VLOOKUP($I$4,'Цвет мет. опор'!A:B,2,0),\"/\",VLOOKUP($J$4,'Цвет лючка'!A:B,2,0),\".\",VLOOKUP($K$4,'Цвет столешницы'!A:B,2,FALSE))","v":"EVL720/П/40*40/ANT/ANT.L"},null,"2210*1436*1098",null,62677]
["EVL721/П/40*40/",{"$f":"CONCATENATE(A102,VLOOKUP($I$4,'Цвет мет. опор'!A:B,2,0),\"/\",VLOOKUP($J$4,'Цвет лючка'!A:B,2,0),\".\",VLOOKUP($K$4,'Цвет столешницы'!A:B,2,FALSE))","v":"EVL721/П/40*40/ANT/ANT.L"},"Стол письменный на П образном м/к 40х40 со шкафом-купе\n(композиция двойной бенч+шкаф-купе)","1410*1240*1098","Шкаф-купе приставной  1240х410х1098",41298]
["EVL722/П/40*40/",{"$f":"CONCATENATE(A103,VLOOKUP($I$4,'Цвет мет. опор'!A:B,2,0),\"/\",VLOOKUP($J$4,'Цвет лючка'!A:B,2,0),\".\",VLOOKUP($K$4,'Цвет столешницы'!A:B,2,FALSE))","v":"EVL722/П/40*40/ANT/ANT.L"},null,"1610*1240*1098",null,42162]
["EVL723/П/40*40/",{"$f":"CONCATENATE(A104,VLOOKUP($I$4,'Цвет мет. опор'!A:B,2,0),\"/\",VLOOKUP($J$4,'Цвет лючка'!A:B,2,0),\".\",VLOOKUP($K$4,'Цвет столешницы'!A:B,2,FALSE))","v":"EVL723/П/40*40/ANT/ANT.L"},null,"1810*1240*1098",null,42840]
["EVL724/П/40*40/",{"$f":"CONCATENATE(A105,VLOOKUP($I$4,'Цвет мет. опор'!A:B,2,0),\"/\",VLOOKUP($J$4,'Цвет лючка'!A:B,2,0),\".\",VLOOKUP($K$4,'Цвет столешницы'!A:B,2,FALSE))","v":"EVL724/П/40*40/ANT/ANT.L"},null,"2010*1240*1098",null,43286]
["EVL725/П/40*40/",{"$f":"CONCATENATE(A106,VLOOKUP($I$4,'Цвет мет. опор'!A:B,2,0),\"/\",VLOOKUP($J$4,'Цвет лючка'!A:B,2,0),\".\",VLOOKUP($K$4,'Цвет столешницы'!A:B,2,FALSE))","v":"EVL725/П/40*40/ANT/ANT.L"},null,"2210*1240*1098",null,44330]
["EVL726/П/40*40/",{"$f":"CONCATENATE(A107,VLOOKUP($I$4,'Цвет мет. опор'!A:B,2,0),\"/\",VLOOKUP($J$4,'Цвет лючка'!A:B,2,0),\".\",VLOOKUP($K$4,'Цвет столешницы'!A:B,2,FALSE))","v":"EVL726/П/40*40/ANT/ANT.L"},"Рабочая станция на П образном м/к 40х40 со шкафом-купе\n(композиция двойной бенч+шкаф-купе)","1410*2332*1098","Шкаф-купе приставной \n2332х410х1098",80258]
["EVL727/П/40*40/",{"$f":"CONCATENATE(A108,VLOOKUP($I$4,'Цвет мет. опор'!A:B,2,0),\"/\",VLOOKUP($J$4,'Цвет лючка'!A:B,2,0),\".\",VLOOKUP($K$4,'Цвет столешницы'!A:B,2,FALSE))","v":"EVL727/П/40*40/ANT/ANT.L"},null,"1610*2332*1098",null,81987]
["EVL728/П/40*40/",{"$f":"CONCATENATE(A109,VLOOKUP($I$4,'Цвет мет. опор'!A:B,2,0),\"/\",VLOOKUP($J$4,'Цвет лючка'!A:B,2,0),\".\",VLOOKUP($K$4,'Цвет столешницы'!A:B,2,FALSE))","v":"EVL728/П/40*40/ANT/ANT.L"},null,"1810*2332*1098",null,83081]
["EVL729/П/40*40/",{"$f":"CONCATENATE(A110,VLOOKUP($I$4,'Цвет мет. опор'!A:B,2,0),\"/\",VLOOKUP($J$4,'Цвет лючка'!A:B,2,0),\".\",VLOOKUP($K$4,'Цвет столешницы'!A:B,2,FALSE))","v":"EVL729/П/40*40/ANT/ANT.L"},null,"2010*2332*1098",null,84786]
["EVL730/П/40*40/",{"$f":"CONCATENATE(A111,VLOOKUP($I$4,'Цвет мет. опор'!A:B,2,0),\"/\",VLOOKUP($J$4,'Цвет лючка'!A:B,2,0),\".\",VLOOKUP($K$4,'Цвет столешницы'!A:B,2,FALSE))","v":"EVL730/П/40*40/ANT/ANT.L"},null,"2210*2332*1098",null,86323]
["EVL731/П/40*40/",{"$f":"CONCATENATE(A112,VLOOKUP($I$4,'Цвет мет. опор'!A:B,2,0),\"/\",VLOOKUP($J$4,'Цвет лючка'!A:B,2,0),\".\",VLOOKUP($K$4,'Цвет столешницы'!A:B,2,FALSE))","v":"EVL731/П/40*40/ANT/ANT.L"},"Рабочая станция на П образном м/к 40х40 с  тумбой левая/правая","1450*1250*750 L","правый",38311]
["EVL732/П/40*40/",{"$f":"CONCATENATE(A113,VLOOKUP($I$4,'Цвет мет. опор'!A:B,2,0),\"/\",VLOOKUP($J$4,'Цвет лючка'!A:B,2,0),\".\",VLOOKUP($K$4,'Цвет столешницы'!A:B,2,FALSE))","v":"EVL732/П/40*40/ANT/ANT.L"},null,"1450*1250*750 R",null,38311]
["EVL733/П/40*40/",{"$f":"CONCATENATE(A114,VLOOKUP($I$4,'Цвет мет. опор'!A:B,2,0),\"/\",VLOOKUP($J$4,'Цвет лючка'!A:B,2,0),\".\",VLOOKUP($K$4,'Цвет столешницы'!A:B,2,FALSE))","v":"EVL733/П/40*40/ANT/ANT.L"},null,"1650*1250*750 L",null,33450]
["EVL734/П/40*40/",{"$f":"CONCATENATE(A115,VLOOKUP($I$4,'Цвет мет. опор'!A:B,2,0),\"/\",VLOOKUP($J$4,'Цвет лючка'!A:B,2,0),\".\",VLOOKUP($K$4,'Цвет столешницы'!A:B,2,FALSE))","v":"EVL734/П/40*40/ANT/ANT.L"},null,"1650*1250*750 R",null,33450]
["EVL735/П/40*40/",{"$f":"CONCATENATE(A116,VLOOKUP($I$4,'Цвет мет. опор'!A:B,2,0),\"/\",VLOOKUP($J$4,'Цвет лючка'!A:B,2,0),\".\",VLOOKUP($K$4,'Цвет столешницы'!A:B,2,FALSE))","v":"EVL735/П/40*40/ANT/ANT.L"},null,"1850*1250*750 L",null,34372]
["EVL736/П/40*40/",{"$f":"CONCATENATE(A117,VLOOKUP($I$4,'Цвет мет. опор'!A:B,2,0),\"/\",VLOOKUP($J$4,'Цвет лючка'!A:B,2,0),\".\",VLOOKUP($K$4,'Цвет столешницы'!A:B,2,FALSE))","v":"EVL736/П/40*40/ANT/ANT.L"},null,"1850*1250*750 R",null,34372]
[null,"Бэнч-системы"]
["EVL645/П/40*40/",{"$f":"CONCATENATE(A119,VLOOKUP($I$4,'Цвет мет. опор'!A:B,2,0),\"/\",VLOOKUP($J$4,'Цвет лючка'!A:B,2,0),\".\",VLOOKUP($K$4,'Цвет столешницы'!A:B,2,FALSE))","v":"EVL645/П/40*40/ANT/ANT.L"},"Рабочая станция на 2 раб.места на П образном м/к 40х40 (бенч-система) глубиной 600","2400*600*750",null,34523]
["EVL646/П/40*40/",{"$f":"CONCATENATE(A120,VLOOKUP($I$4,'Цвет мет. опор'!A:B,2,0),\"/\",VLOOKUP($J$4,'Цвет лючка'!A:B,2,0),\".\",VLOOKUP($K$4,'Цвет столешницы'!A:B,2,FALSE))","v":"EVL646/П/40*40/ANT/ANT.L"},null,"2800*600*750",null,34379]
["EVL647/П/40*40/",{"$f":"CONCATENATE(A121,VLOOKUP($I$4,'Цвет мет. опор'!A:B,2,0),\"/\",VLOOKUP($J$4,'Цвет лючка'!A:B,2,0),\".\",VLOOKUP($K$4,'Цвет столешницы'!A:B,2,FALSE))","v":"EVL647/П/40*40/ANT/ANT.L"},null,"3200*600*750",null,37228]
["EVL648/П/40*40/",{"$f":"CONCATENATE(A122,VLOOKUP($I$4,'Цвет мет. опор'!A:B,2,0),\"/\",VLOOKUP($J$4,'Цвет лючка'!A:B,2,0),\".\",VLOOKUP($K$4,'Цвет столешницы'!A:B,2,FALSE))","v":"EVL648/П/40*40/ANT/ANT.L"},"Рабочая станция на 2 раб.места на П образном м/к 40х40 (бенч-система) глубиной 700","2400*700*750",null,35870]
["EVL649/П/40*40/",{"$f":"CONCATENATE(A123,VLOOKUP($I$4,'Цвет мет. опор'!A:B,2,0),\"/\",VLOOKUP($J$4,'Цвет лючка'!A:B,2,0),\".\",VLOOKUP($K$4,'Цвет столешницы'!A:B,2,FALSE))","v":"EVL649/П/40*40/ANT/ANT.L"},null,"2800*700*750",null,37150]
["EVL650/П/40*40/",{"$f":"CONCATENATE(A124,VLOOKUP($I$4,'Цвет мет. опор'!A:B,2,0),\"/\",VLOOKUP($J$4,'Цвет лючка'!A:B,2,0),\".\",VLOOKUP($K$4,'Цвет столешницы'!A:B,2,FALSE))","v":"EVL650/П/40*40/ANT/ANT.L"},null,"3200*700*750",null,38671]
["EVL651/П/40*40/",{"$f":"CONCATENATE(A125,VLOOKUP($I$4,'Цвет мет. опор'!A:B,2,0),\"/\",VLOOKUP($J$4,'Цвет лючка'!A:B,2,0),\".\",VLOOKUP($K$4,'Цвет столешницы'!A:B,2,FALSE))","v":"EVL651/П/40*40/ANT/ANT.L"},"Рабочая станция на 2 раб.места на П образном м/к 40х40 (бенч-система) глубиной 800","2400*800*750",null,36680]
["EVL652/П/40*40/",{"$f":"CONCATENATE(A126,VLOOKUP($I$4,'Цвет мет. опор'!A:B,2,0),\"/\",VLOOKUP($J$4,'Цвет лючка'!A:B,2,0),\".\",VLOOKUP($K$4,'Цвет столешницы'!A:B,2,FALSE))","v":"EVL652/П/40*40/ANT/ANT.L"},null,"2800*800*750",null,38442]
["EVL653/П/40*40/",{"$f":"CONCATENATE(A127,VLOOKUP($I$4,'Цвет мет. опор'!A:B,2,0),\"/\",VLOOKUP($J$4,'Цвет лючка'!A:B,2,0),\".\",VLOOKUP($K$4,'Цвет столешницы'!A:B,2,FALSE))","v":"EVL653/П/40*40/ANT/ANT.L"},null,"3200*800*750",null,39313]
["EVL654/П/40*40/",{"$f":"CONCATENATE(A128,VLOOKUP($I$4,'Цвет мет. опор'!A:B,2,0),\"/\",VLOOKUP($J$4,'Цвет лючка'!A:B,2,0),\".\",VLOOKUP($K$4,'Цвет столешницы'!A:B,2,FALSE))","v":"EVL654/П/40*40/ANT/ANT.L"},"Рабочая станция на 3 раб.места на П образном м/к 40х40 (бенч-система), глубиной 600 мм","3600*600*750",null,50607]
["EVL655/П/40*40/",{"$f":"CONCATENATE(A129,VLOOKUP($I$4,'Цвет мет. опор'!A:B,2,0),\"/\",VLOOKUP($J$4,'Цвет лючка'!A:B,2,0),\".\",VLOOKUP($K$4,'Цвет столешницы'!A:B,2,FALSE))","v":"EVL655/П/40*40/ANT/ANT.L"},null,"4200*600*750",null,52032]
["EVL656/П/40*40/",{"$f":"CONCATENATE(A130,VLOOKUP($I$4,'Цвет мет. опор'!A:B,2,0),\"/\",VLOOKUP($J$4,'Цвет лючка'!A:B,2,0),\".\",VLOOKUP($K$4,'Цвет столешницы'!A:B,2,FALSE))","v":"EVL656/П/40*40/ANT/ANT.L"},null,"4800*600*750",null,54665]
["EVL657/П/40*40/",{"$f":"CONCATENATE(A131,VLOOKUP($I$4,'Цвет мет. опор'!A:B,2,0),\"/\",VLOOKUP($J$4,'Цвет лючка'!A:B,2,0),\".\",VLOOKUP($K$4,'Цвет столешницы'!A:B,2,FALSE))","v":"EVL657/П/40*40/ANT/ANT.L"},"Рабочая станция на 3 раб.места на П образном м/к 40х40 (бенч-система), глубиной 700 мм","3600*700*750",null,52915]
["EVL658/П/40*40/",{"$f":"CONCATENATE(A132,VLOOKUP($I$4,'Цвет мет. опор'!A:B,2,0),\"/\",VLOOKUP($J$4,'Цвет лючка'!A:B,2,0),\".\",VLOOKUP($K$4,'Цвет столешницы'!A:B,2,FALSE))","v":"EVL658/П/40*40/ANT/ANT.L"},null,"4200*700*750",null,55192]
["EVL659/П/40*40/",{"$f":"CONCATENATE(A133,VLOOKUP($I$4,'Цвет мет. опор'!A:B,2,0),\"/\",VLOOKUP($J$4,'Цвет лючка'!A:B,2,0),\".\",VLOOKUP($K$4,'Цвет столешницы'!A:B,2,FALSE))","v":"EVL659/П/40*40/ANT/ANT.L"},null,"4800*700*750",null,57113]
["EVL660/П/40*40/",{"$f":"CONCATENATE(A134,VLOOKUP($I$4,'Цвет мет. опор'!A:B,2,0),\"/\",VLOOKUP($J$4,'Цвет лючка'!A:B,2,0),\".\",VLOOKUP($K$4,'Цвет столешницы'!A:B,2,FALSE))","v":"EVL660/П/40*40/ANT/ANT.L"},"Рабочая станция на 3 раб.места на П образном м/к 40х40 (бенч-система), глубиной 800 мм","3600*800*750",null,53420]
["EVL661/П/40*40/",{"$f":"CONCATENATE(A135,VLOOKUP($I$4,'Цвет мет. опор'!A:B,2,0),\"/\",VLOOKUP($J$4,'Цвет лючка'!A:B,2,0),\".\",VLOOKUP($K$4,'Цвет столешницы'!A:B,2,FALSE))","v":"EVL661/П/40*40/ANT/ANT.L"},null,"4200*800*750",null,56335]
["EVL662/П/40*40/",{"$f":"CONCATENATE(A136,VLOOKUP($I$4,'Цвет мет. опор'!A:B,2,0),\"/\",VLOOKUP($J$4,'Цвет лючка'!A:B,2,0),\".\",VLOOKUP($K$4,'Цвет столешницы'!A:B,2,FALSE))","v":"EVL662/П/40*40/ANT/ANT.L"},null,"4800*800*750",null,58330]
["EVL663/П/40*40/",{"$f":"CONCATENATE(A137,VLOOKUP($I$4,'Цвет мет. опор'!A:B,2,0),\"/\",VLOOKUP($J$4,'Цвет лючка'!A:B,2,0),\".\",VLOOKUP($K$4,'Цвет столешницы'!A:B,2,FALSE))","v":"EVL663/П/40*40/ANT/ANT.L"},"Рабочая станция на 4 раб.места на П образном м/к 40х40","2400*1236*750",null,60224]
["EVL664/П/40*40/",{"$f":"CONCATENATE(A138,VLOOKUP($I$4,'Цвет мет. опор'!A:B,2,0),\"/\",VLOOKUP($J$4,'Цвет лючка'!A:B,2,0),\".\",VLOOKUP($K$4,'Цвет столешницы'!A:B,2,FALSE))","v":"EVL664/П/40*40/ANT/ANT.L"},null,"2800*1236*750",null,62123]
["EVL665/П/40*40/",{"$f":"CONCATENATE(A139,VLOOKUP($I$4,'Цвет мет. опор'!A:B,2,0),\"/\",VLOOKUP($J$4,'Цвет лючка'!A:B,2,0),\".\",VLOOKUP($K$4,'Цвет столешницы'!A:B,2,FALSE))","v":"EVL665/П/40*40/ANT/ANT.L"},null,"3200*1236*750",null,65633]
["EVL666/П/40*40/",{"$f":"CONCATENATE(A140,VLOOKUP($I$4,'Цвет мет. опор'!A:B,2,0),\"/\",VLOOKUP($J$4,'Цвет лючка'!A:B,2,0),\".\",VLOOKUP($K$4,'Цвет столешницы'!A:B,2,FALSE))","v":"EVL666/П/40*40/ANT/ANT.L"},"Рабочая станция на 4 раб.места на П образном м/к 40х40","2400*1436*750",null,62497]
["EVL667/П/40*40/",{"$f":"CONCATENATE(A141,VLOOKUP($I$4,'Цвет мет. опор'!A:B,2,0),\"/\",VLOOKUP($J$4,'Цвет лючка'!A:B,2,0),\".\",VLOOKUP($K$4,'Цвет столешницы'!A:B,2,FALSE))","v":"EVL667/П/40*40/ANT/ANT.L"},null,"2800*1436*750",null,65893]
["EVL668/П/40*40/",{"$f":"CONCATENATE(A142,VLOOKUP($I$4,'Цвет мет. опор'!A:B,2,0),\"/\",VLOOKUP($J$4,'Цвет лючка'!A:B,2,0),\".\",VLOOKUP($K$4,'Цвет столешницы'!A:B,2,FALSE))","v":"EVL668/П/40*40/ANT/ANT.L"},null,"3200*1436*750",null,68098]
["EVL669/П/40*40/",{"$f":"CONCATENATE(A143,VLOOKUP($I$4,'Цвет мет. опор'!A:B,2,0),\"/\",VLOOKUP($J$4,'Цвет лючка'!A:B,2,0),\".\",VLOOKUP($K$4,'Цвет столешницы'!A:B,2,FALSE))","v":"EVL669/П/40*40/ANT/ANT.L"},"Рабочая станция на 4 раб.места на П образном м/к 40х40","2400*1636*750",null,64769]
["EVL670/П/40*40/",{"$f":"CONCATENATE(A144,VLOOKUP($I$4,'Цвет мет. опор'!A:B,2,0),\"/\",VLOOKUP($J$4,'Цвет лючка'!A:B,2,0),\".\",VLOOKUP($K$4,'Цвет столешницы'!A:B,2,FALSE))","v":"EVL670/П/40*40/ANT/ANT.L"},null,"2800*1636*750",null,68294]
["EVL671/П/40*40/",{"$f":"CONCATENATE(A145,VLOOKUP($I$4,'Цвет мет. опор'!A:B,2,0),\"/\",VLOOKUP($J$4,'Цвет лючка'!A:B,2,0),\".\",VLOOKUP($K$4,'Цвет столешницы'!A:B,2,FALSE))","v":"EVL671/П/40*40/ANT/ANT.L"},null,"3200*1636*750",null,70036]
["EVL672/П/40*40/",{"$f":"CONCATENATE(A146,VLOOKUP($I$4,'Цвет мет. опор'!A:B,2,0),\"/\",VLOOKUP($J$4,'Цвет лючка'!A:B,2,0),\".\",VLOOKUP($K$4,'Цвет столешницы'!A:B,2,FALSE))","v":"EVL672/П/40*40/ANT/ANT.L"},"Рабочая станция на 6 раб.места на П образном м/к 40х40 с шириной 1-го рабочего места 600 мм","3600*1236*750",null,88895]
["EVL673/П/40*40/",{"$f":"CONCATENATE(A147,VLOOKUP($I$4,'Цвет мет. опор'!A:B,2,0),\"/\",VLOOKUP($J$4,'Цвет лючка'!A:B,2,0),\".\",VLOOKUP($K$4,'Цвет столешницы'!A:B,2,FALSE))","v":"EVL673/П/40*40/ANT/ANT.L"},null,"4200*1236*750",null,91743]
["EVL674/П/40*40/",{"$f":"CONCATENATE(A148,VLOOKUP($I$4,'Цвет мет. опор'!A:B,2,0),\"/\",VLOOKUP($J$4,'Цвет лючка'!A:B,2,0),\".\",VLOOKUP($K$4,'Цвет столешницы'!A:B,2,FALSE))","v":"EVL674/П/40*40/ANT/ANT.L"},null,"4800*1236*750",null,97009]
["EVL675/П/40*40/",{"$f":"CONCATENATE(A149,VLOOKUP($I$4,'Цвет мет. опор'!A:B,2,0),\"/\",VLOOKUP($J$4,'Цвет лючка'!A:B,2,0),\".\",VLOOKUP($K$4,'Цвет столешницы'!A:B,2,FALSE))","v":"EVL675/П/40*40/ANT/ANT.L"},"Рабочая станция на 6 раб.места на П образном м/к 40х40 с шириной 1-го рабочего места 700 мм","3600*1436*750",null,92347]
["EVL676/П/40*40/",{"$f":"CONCATENATE(A150,VLOOKUP($I$4,'Цвет мет. опор'!A:B,2,0),\"/\",VLOOKUP($J$4,'Цвет лючка'!A:B,2,0),\".\",VLOOKUP($K$4,'Цвет столешницы'!A:B,2,FALSE))","v":"EVL676/П/40*40/ANT/ANT.L"},null,"4200*1436*750",null,97442]
["EVL677/П/40*40/",{"$f":"CONCATENATE(A151,VLOOKUP($I$4,'Цвет мет. опор'!A:B,2,0),\"/\",VLOOKUP($J$4,'Цвет лючка'!A:B,2,0),\".\",VLOOKUP($K$4,'Цвет столешницы'!A:B,2,FALSE))","v":"EVL677/П/40*40/ANT/ANT.L"},null,"4800*1436*750",null,100750]
["EVL678/П/40*40/",{"$f":"CONCATENATE(A152,VLOOKUP($I$4,'Цвет мет. опор'!A:B,2,0),\"/\",VLOOKUP($J$4,'Цвет лючка'!A:B,2,0),\".\",VLOOKUP($K$4,'Цвет столешницы'!A:B,2,FALSE))","v":"EVL678/П/40*40/ANT/ANT.L"},"Рабочая станция на 6 раб.места на П образном м/к 40х40 с шириной 1-го рабочего места 800 мм","3600*1636*750",null,95315]
["EVL679/П/40*40/",{"$f":"CONCATENATE(A153,VLOOKUP($I$4,'Цвет мет. опор'!A:B,2,0),\"/\",VLOOKUP($J$4,'Цвет лючка'!A:B,2,0),\".\",VLOOKUP($K$4,'Цвет столешницы'!A:B,2,FALSE))","v":"EVL679/П/40*40/ANT/ANT.L"},null,"4200*1636*750",null,100602]
["EVL680/П/40*40/",{"$f":"CONCATENATE(A154,VLOOKUP($I$4,'Цвет мет. опор'!A:B,2,0),\"/\",VLOOKUP($J$4,'Цвет лючка'!A:B,2,0),\".\",VLOOKUP($K$4,'Цвет столешницы'!A:B,2,FALSE))","v":"EVL680/П/40*40/ANT/ANT.L"},null,"4800*1636*750",null,103215]
[null,"Переговорные столы"]
["EVL800/П/40*40/",{"$f":"CONCATENATE(A156,VLOOKUP($I$4,'Цвет мет. опор'!A:B,2,0),\".\",VLOOKUP($K$4,'Цвет столешницы'!A:B,2,FALSE))","v":"EVL800/П/40*40/ANT.L"},"Переговорный стол (1 столешница) \nна П образном м/к 40х40","1000*1236*750",null,30348]
["EVL801/П/40*40/",{"$f":"CONCATENATE(A157,VLOOKUP($I$4,'Цвет мет. опор'!A:B,2,0),\".\",VLOOKUP($K$4,'Цвет столешницы'!A:B,2,FALSE))","v":"EVL801/П/40*40/ANT.L"},null,"1200*1236*750",null,31589]
["EVL802/П/40*40/",{"$f":"CONCATENATE(A158,VLOOKUP($I$4,'Цвет мет. опор'!A:B,2,0),\".\",VLOOKUP($K$4,'Цвет столешницы'!A:B,2,FALSE))","v":"EVL802/П/40*40/ANT.L"},null,"1400*1236*750",null,27319]
["EVL803/П/40*40/",{"$f":"CONCATENATE(A159,VLOOKUP($I$4,'Цвет мет. опор'!A:B,2,0),\".\",VLOOKUP($K$4,'Цвет столешницы'!A:B,2,FALSE))","v":"EVL803/П/40*40/ANT.L"},null,"1600*1236*750",null,34958]
["EVL804/П/40*40/",{"$f":"CONCATENATE(A160,VLOOKUP($I$4,'Цвет мет. опор'!A:B,2,0),\".\",VLOOKUP($K$4,'Цвет столешницы'!A:B,2,FALSE))","v":"EVL804/П/40*40/ANT.L"},null,"1800*1236*750",null,36896]
["EVL805/П/40*40/",{"$f":"CONCATENATE(A161,VLOOKUP($I$4,'Цвет мет. опор'!A:B,2,0),\".\",VLOOKUP($K$4,'Цвет столешницы'!A:B,2,FALSE))","v":"EVL805/П/40*40/ANT.L"},"Переговорный стол (2 столешницы)\n на П образном м/к 40х40","2000*1236*750",null,51362]
["EVL806/П/40*40/",{"$f":"CONCATENATE(A162,VLOOKUP($I$4,'Цвет мет. опор'!A:B,2,0),\".\",VLOOKUP($K$4,'Цвет столешницы'!A:B,2,FALSE))","v":"EVL806/П/40*40/ANT.L"},null,"2400*1236*750",null,53455]
["EVL807/П/40*40/",{"$f":"CONCATENATE(A163,VLOOKUP($I$4,'Цвет мет. опор'!A:B,2,0),\".\",VLOOKUP($K$4,'Цвет столешницы'!A:B,2,FALSE))","v":"EVL807/П/40*40/ANT.L"},null,"2800*1236*750",null,55948]
["EVL808/П/40*40/",{"$f":"CONCATENATE(A164,VLOOKUP($I$4,'Цвет мет. опор'!A:B,2,0),\".\",VLOOKUP($K$4,'Цвет столешницы'!A:B,2,FALSE))","v":"EVL808/П/40*40/ANT.L"},null,"3200*1236*750",null,66111]
["EVL809/П/40*40/",{"$f":"CONCATENATE(A165,VLOOKUP($I$4,'Цвет мет. опор'!A:B,2,0),\".\",VLOOKUP($K$4,'Цвет столешницы'!A:B,2,FALSE))","v":"EVL809/П/40*40/ANT.L"},null,"3600*1236*750",null,69900]
["EVL810/П/40*40/",{"$f":"CONCATENATE(A166,VLOOKUP($I$4,'Цвет мет. опор'!A:B,2,0),\".\",VLOOKUP($K$4,'Цвет столешницы'!A:B,2,FALSE))","v":"EVL810/П/40*40/ANT.L"},"Переговорный стол (3 столешницы)\n на П образном м/к 40х40","3000*1236*750",null,71261]
["EVL811/П/40*40/",{"$f":"CONCATENATE(A167,VLOOKUP($I$4,'Цвет мет. опор'!A:B,2,0),\".\",VLOOKUP($K$4,'Цвет столешницы'!A:B,2,FALSE))","v":"EVL811/П/40*40/ANT.L"},null,"3600*1236*750",null,78174]
["EVL812/П/40*40/",{"$f":"CONCATENATE(A168,VLOOKUP($I$4,'Цвет мет. опор'!A:B,2,0),\".\",VLOOKUP($K$4,'Цвет столешницы'!A:B,2,FALSE))","v":"EVL812/П/40*40/ANT.L"},null,"4200*1236*750",null,81914]
["EVL813/П/40*40/",{"$f":"CONCATENATE(A169,VLOOKUP($I$4,'Цвет мет. опор'!A:B,2,0),\".\",VLOOKUP($K$4,'Цвет столешницы'!A:B,2,FALSE))","v":"EVL813/П/40*40/ANT.L"},null,"4800*1236*750",null,84346]
["EVL814/П/40*40/",{"$f":"CONCATENATE(A170,VLOOKUP($I$4,'Цвет мет. опор'!A:B,2,0),\".\",VLOOKUP($K$4,'Цвет столешницы'!A:B,2,FALSE))","v":"EVL814/П/40*40/ANT.L"},null,"5400*1236*750",null,87441]
["EVL841/П/40*40/",{"$f":"CONCATENATE(A171,VLOOKUP($I$4,'Цвет мет. опор'!A:B,2,0),\".\",VLOOKUP($K$4,'Цвет столешницы'!A:B,2,FALSE))","v":"EVL841/П/40*40/ANT.L"},"Переговорный стол (3 столешницы)\n на П-образном м/к 40х40","3600*1436*750",null,80596]
["EVL842/П/40*40/",{"$f":"CONCATENATE(A172,VLOOKUP($I$4,'Цвет мет. опор'!A:B,2,0),\".\",VLOOKUP($K$4,'Цвет столешницы'!A:B,2,FALSE))","v":"EVL842/П/40*40/ANT.L"},null,"4200*1436*750",null,84444]
["EVL843/П/40*40/",{"$f":"CONCATENATE(A173,VLOOKUP($I$4,'Цвет мет. опор'!A:B,2,0),\".\",VLOOKUP($K$4,'Цвет столешницы'!A:B,2,FALSE))","v":"EVL843/П/40*40/ANT.L"},null,"4800*1436*750",null,86975]
["EVL844/П/40*40/",{"$f":"CONCATENATE(A174,VLOOKUP($I$4,'Цвет мет. опор'!A:B,2,0),\".\",VLOOKUP($K$4,'Цвет столешницы'!A:B,2,FALSE))","v":"EVL844/П/40*40/ANT.L"},null,"5400*1436*750",null,89106]
[null,null,"Кодировка Артикула стола"]
[null,null,"Модель стола разворот стола /Цвет опор/Цв. заглушки. Цвет столешницы  "]
[null,"МОДЕЛЬ СТОЛА (ФОРМА, РАЗМЕР)","ПРАВОСТОРОННИЙ /ЛЕВОСТОРОННИЙ","ЦВЕТ ОПОР","ЦВЕТ ЗАГЛУШКИ, РУЧЕК","ЦВЕТ СТОЛЕШНИЦЫ"]
[null,null,"SX-левый","АNT-АНТРАЦИТ","АNT-АНТРАЦИТ","H","Белый"]
[null,null,"DX-правый","WHT-БЕЛЫЙ ","H-БЕЛЫЙ ","U727 ","Серый Камень"]
[null,null,null,"GR-СЕРЫЙ","G-СЕРЫЙ","R2","Серый"]
[null,null,null,null,null,"ANT","Антрацит"]
[null,null,null,null,null,"U003","Дуб Честерфилд"]
[null,null,null,null,null,"L","Дуб 131"]

{"sheet":"Столы на А обр. 40х40","index":6,"n_rows":177,"n_cols":11,"rows_kept":177,"cut":false,"hidden":false,"merged":[[44,4,47,4],[27,4,29,4],[130,2,132,2],[130,4,132,4],[133,2,135,2],[30,2,31,2],[1,8,1,10],[1,6,3,6],[20,2,21,2],[20,4,21,4],[22,2,24,2],[22,4,24,4],[25,2,26,2],[25,4,26,4],[5,2,8,2],[5,4,8,4],[9,2,13,2],[9,4,13,4],[14,2,18,2],[14,4,18,4],[1,1,1,5],[2,1,3,5],[133,4,135,4],[48,2,50,2],[0,8,0,10],[30,4,31,4],[60,2,62,2],[60,4,62,4],[63,2,65,2],[63,4,65,4],[27,2,29,2],[127,2,129,2],[127,4,129,4],[66,2,68,2],[66,4,68,4],[32,2,33,2],[32,4,33,4],[54,2,55,2],[48,4,50,4],[51,2,53,2],[51,4,53,4],[34,2,35,2],[34,4,35,4],[36,2,39,2],[36,4,39,4],[40,4,43,4],[40,2,43,2],[44,2,47,2],[112,2,114,2],[112,4,114,4],[86,2,90,2],[86,4,90,4],[91,2,95,2],[91,4,95,4],[75,2,77,2],[75,4,77,4],[81,2,85,2],[81,4,85,4],[111,0,111,4],[69,2,71,2],[69,4,71,4],[72,2,74,2],[72,4,74,4],[54,4,55,4],[56,2,57,2],[56,4,57,4],[58,2,59,2],[58,4,59,4],[149,2,153,2],[149,4,153,4],[154,2,158,2],[154,4,158,4],[139,2,141,2],[142,2,144,2],[168,7,168,8],[169,7,169,8],[136,2,138,2],[159,2,163,2],[159,4,163,4],[148,1,148,4],[170,5,170,6],[79,4,80,4],[79,2,80,2],[164,2,167,2],[164,4,167,4],[145,2,147,2],[139,4,141,4],[142,4,144,4],[145,4,147,4],[124,4,126,4],[115,2,117,2],[115,4,117,4],[96,2,100,2],[96,4,100,4],[101,2,105,2],[101,4,105,4],[106,2,110,2],[106,4,110,4],[118,2,120,2],[118,4,120,4],[121,2,123,2],[121,4,123,4],[124,2,126,2],[136,4,138,4]]}
[null,"EVOLUTION",null,null,null,{"$f":"Склаская!F1","v":"2025-05-23"}]
[null,"Столы, бенчи и рабочие станции на металлокаркасе: А-образные опоры - труба с сечением 40*40мм, траверсы - труба 40*20мм в цв. Антрацит, Белый*  Столешницы ЛДСП - 25 мм.",null,null,null,null,null,null,"Формирование артикула \nв зависимости от выбранных характеристик"]
[null,"Не складская программа производятся на заказ партией от 6 шт., со сроком по согласованию с производством, в цвете: Дуб Честерфилд, Белый, Антрацит, Серый R2, Дуб 131, Серый камень, Венге Цаво, Бетон. Опоры столов в цв. Антрацит, Белый, Серый.\nЗаглушки кабель-каналов и ручки тумб: Антрацит, Белый.\nДля заказа изделия следует пользоваться правилами кодировки для создания  артикула.  →→→→",null,null,null,null,null,null,"Цвет Опор","Цвет кабель-канала","Цвет столешницы"]
[null,null,null,null,null,null,null,null,"Антрацит","Белый","Дуб Честерфилд"]
[null,"Артикул","Наименование","Размеры Ш*Г*В (мм)","Изображение","Розничная Цена, руб."]
["EVL113/А/40*40/",{"$f":"CONCATENATE(A6,VLOOKUP($I$4,'Цвет мет. опор'!A:B,2,0),\"/\",VLOOKUP($J$4,'Цвет лючка'!A:B,2,0),\".\",VLOOKUP($K$4,'Цвет столешницы'!A:B,2,FALSE))","v":"EVL113/А/40*40/ANT/H.U003"},"Стол письменный на А образном м/к 40х40, глубиной 600 мм","1000*600*750",null,17696]
["EVL114/А/40*40/",{"$f":"CONCATENATE(A7,VLOOKUP($I$4,'Цвет мет. опор'!A:B,2,0),\"/\",VLOOKUP($J$4,'Цвет лючка'!A:B,2,0),\".\",VLOOKUP($K$4,'Цвет столешницы'!A:B,2,FALSE))","v":"EVL114/А/40*40/ANT/H.U003"},null,"1200*600*750",null,18438]
["EVL115/А/40*40/",{"$f":"CONCATENATE(A8,VLOOKUP($I$4,'Цвет мет. опор'!A:B,2,0),\"/\",VLOOKUP($J$4,'Цвет лючка'!A:B,2,0),\".\",VLOOKUP($K$4,'Цвет столешницы'!A:B,2,FALSE))","v":"EVL115/А/40*40/ANT/H.U003"},null,"1400*600*750",null,18783]
["EVL116/А/40*40/",{"$f":"CONCATENATE(A9,VLOOKUP($I$4,'Цвет мет. опор'!A:B,2,0),\"/\",VLOOKUP($J$4,'Цвет лючка'!A:B,2,0),\".\",VLOOKUP($K$4,'Цвет столешницы'!A:B,2,FALSE))","v":"EVL116/А/40*40/ANT/H.U003"},null,"1600*600*750",null,19791]
["EVL100/А/40*40/",{"$f":"CONCATENATE(A10,VLOOKUP($I$4,'Цвет мет. опор'!A:B,2,0),\"/\",VLOOKUP($J$4,'Цвет лючка'!A:B,2,0),\".\",VLOOKUP($K$4,'Цвет столешницы'!A:B,2,FALSE))","v":"EVL100/А/40*40/ANT/H.U003"},"Стол письменный на А образном м/к 40х40, глубиной 700 мм","1000*700*750",null,18348]
["EVL101/А/40*40/",{"$f":"CONCATENATE(A11,VLOOKUP($I$4,'Цвет мет. опор'!A:B,2,0),\"/\",VLOOKUP($J$4,'Цвет лючка'!A:B,2,0),\".\",VLOOKUP($K$4,'Цвет столешницы'!A:B,2,FALSE))","v":"EVL101/А/40*40/ANT/H.U003"},null,"1200*700*750",null,19213]
["EVL102/0/40*40",{"$f":"CONCATENATE(A12,VLOOKUP($I$4,'Цвет мет. опор'!A:B,2,0),\"/\",VLOOKUP($J$4,'Цвет лючка'!A:B,2,0),\".\",VLOOKUP($K$4,'Цвет столешницы'!A:B,2,FALSE))","v":"EVL102/0/40*40ANT/H.U003"},null,"1400*700*750",null,19972]
["EVL103/0/40*40",{"$f":"CONCATENATE(A13,VLOOKUP($I$4,'Цвет мет. опор'!A:B,2,0),\"/\",VLOOKUP($J$4,'Цвет лючка'!A:B,2,0),\".\",VLOOKUP($K$4,'Цвет столешницы'!A:B,2,FALSE))","v":"EVL103/0/40*40ANT/H.U003"},null,"1600*700*750",null,20612]
["EVL104/А/40*40/",{"$f":"CONCATENATE(A14,VLOOKUP($I$4,'Цвет мет. опор'!A:B,2,0),\"/\",VLOOKUP($J$4,'Цвет лючка'!A:B,2,0),\".\",VLOOKUP($K$4,'Цвет столешницы'!A:B,2,FALSE))","v":"EVL104/А/40*40/ANT/H.U003"},null,"1800*700*750",null,21381]
["EVL117/А/40*40/",{"$f":"CONCATENATE(A15,VLOOKUP($I$4,'Цвет мет. опор'!A:B,2,0),\"/\",VLOOKUP($J$4,'Цвет лючка'!A:B,2,0),\".\",VLOOKUP($K$4,'Цвет столешницы'!A:B,2,FALSE))","v":"EVL117/А/40*40/ANT/H.U003"},"Стол письменный на А образном м/к 40х40, глубиной 800 мм","1000*800*750",null,18544]
["EVL118/А/40*40/",{"$f":"CONCATENATE(A16,VLOOKUP($I$4,'Цвет мет. опор'!A:B,2,0),\"/\",VLOOKUP($J$4,'Цвет лючка'!A:B,2,0),\".\",VLOOKUP($K$4,'Цвет столешницы'!A:B,2,FALSE))","v":"EVL118/А/40*40/ANT/H.U003"},null,"1200*800*750",null,19648]
["EVL119/А/40*40/",{"$f":"CONCATENATE(A17,VLOOKUP($I$4,'Цвет мет. опор'!A:B,2,0),\"/\",VLOOKUP($J$4,'Цвет лючка'!A:B,2,0),\".\",VLOOKUP($K$4,'Цвет столешницы'!A:B,2,FALSE))","v":"EVL119/А/40*40/ANT/H.U003"},null,"1400*800*750",null,20529]
["EVL120/А/40*40/",{"$f":"CONCATENATE(A18,VLOOKUP($I$4,'Цвет мет. опор'!A:B,2,0),\"/\",VLOOKUP($J$4,'Цвет лючка'!A:B,2,0),\".\",VLOOKUP($K$4,'Цвет столешницы'!A:B,2,FALSE))","v":"EVL120/А/40*40/ANT/H.U003"},null,"1600*800*750",null,21284]
["EVL121/А/40*40/",{"$f":"CONCATENATE(A19,VLOOKUP($I$4,'Цвет мет. опор'!A:B,2,0),\"/\",VLOOKUP($J$4,'Цвет лючка'!A:B,2,0),\".\",VLOOKUP($K$4,'Цвет столешницы'!A:B,2,FALSE))","v":"EVL121/А/40*40/ANT/H.U003"},null,"1800*800*750",null,22181]
["EVL122/А/40*40/",{"$f":"CONCATENATE(A20,VLOOKUP($I$4,'Цвет мет. опор'!A:B,2,0),\"/\",VLOOKUP($J$4,'Цвет лючка'!A:B,2,0),\".\",VLOOKUP($K$4,'Цвет столешницы'!A:B,2,FALSE))","v":"EVL122/А/40*40/ANT/H.U003"},"Стол письменный на А образном м/к 40х40, глубиной 900 мм","1800*900*750",null,22433]
["EVL123SX(DX)/А/40*40/",{"$f":"CONCATENATE(A21,VLOOKUP($I$4,'Цвет мет. опор'!A:B,2,0),\"/\",VLOOKUP($J$4,'Цвет лючка'!A:B,2,0),\".\",VLOOKUP($K$4,'Цвет столешницы'!A:B,2,FALSE))","v":"EVL123SX(DX)/А/40*40/ANT/H.U003"},"Стол криволинейный левый/правый на А образном м/к 40х40, глубиной 600/900 мм","1200*900*750","правый",19108]
["EVL124SX(DX)/А/40*40/",{"$f":"CONCATENATE(A22,VLOOKUP($I$4,'Цвет мет. опор'!A:B,2,0),\"/\",VLOOKUP($J$4,'Цвет лючка'!A:B,2,0),\".\",VLOOKUP($K$4,'Цвет столешницы'!A:B,2,FALSE))","v":"EVL124SX(DX)/А/40*40/ANT/H.U003"},null,"1400*900*750",null,20184]
["EVL105SX(DX)/А/40*40/",{"$f":"CONCATENATE(A23,VLOOKUP($I$4,'Цвет мет. опор'!A:B,2,0),\"/\",VLOOKUP($J$4,'Цвет лючка'!A:B,2,0),\".\",VLOOKUP($K$4,'Цвет столешницы'!A:B,2,FALSE))","v":"EVL105SX(DX)/А/40*40/ANT/H.U003"},"Стол криволинейный левый/правый на А образном м/к 40х40, глубиной 700/900 мм","1200*900*750","правый",15794]
["EVL106SX(DX)/А/40*40/",{"$f":"CONCATENATE(A24,VLOOKUP($I$4,'Цвет мет. опор'!A:B,2,0),\"/\",VLOOKUP($J$4,'Цвет лючка'!A:B,2,0),\".\",VLOOKUP($K$4,'Цвет столешницы'!A:B,2,FALSE))","v":"EVL106SX(DX)/А/40*40/ANT/H.U003"},null,"1400*900*750",null,16413]
["EVL107SX(DX)/А/40*40/",{"$f":"CONCATENATE(A25,VLOOKUP($I$4,'Цвет мет. опор'!A:B,2,0),\"/\",VLOOKUP($J$4,'Цвет лючка'!A:B,2,0),\".\",VLOOKUP($K$4,'Цвет столешницы'!A:B,2,FALSE))","v":"EVL107SX(DX)/А/40*40/ANT/H.U003"},null,"1600*900*750",null,17226]
["EVL125SX(DX)/А/40*40/",{"$f":"CONCATENATE(A26,VLOOKUP($I$4,'Цвет мет. опор'!A:B,2,0),\"/\",VLOOKUP($J$4,'Цвет лючка'!A:B,2,0),\".\",VLOOKUP($K$4,'Цвет столешницы'!A:B,2,FALSE))","v":"EVL125SX(DX)/А/40*40/ANT/H.U003"},"Стол криволинейный левый/правый на А образном м/к 40х40, глубиной 800/900 мм","1400*900*750",null,16423]
["EVL126SX(DX)/А/40*40/",{"$f":"CONCATENATE(A27,VLOOKUP($I$4,'Цвет мет. опор'!A:B,2,0),\"/\",VLOOKUP($J$4,'Цвет лючка'!A:B,2,0),\".\",VLOOKUP($K$4,'Цвет столешницы'!A:B,2,FALSE))","v":"EVL126SX(DX)/А/40*40/ANT/H.U003"},null,"1600*900*750",null,17239]
["EVL109SX(DX)/А/40*40",{"$f":"CONCATENATE(A28,VLOOKUP($I$4,'Цвет мет. опор'!A:B,2,0),\"/\",VLOOKUP($J$4,'Цвет лючка'!A:B,2,0),\".\",VLOOKUP($K$4,'Цвет столешницы'!A:B,2,FALSE))","v":"EVL109SX(DX)/А/40*40ANT/H.U003"},"Стол эргономичный левый/правый на А образном м/к 40х40, глубиной 700/900 мм","1200х900/700х750",null,15763]
["EVL110SX(DX)/А/40*40",{"$f":"CONCATENATE(A29,VLOOKUP($I$4,'Цвет мет. опор'!A:B,2,0),\"/\",VLOOKUP($J$4,'Цвет лючка'!A:B,2,0),\".\",VLOOKUP($K$4,'Цвет столешницы'!A:B,2,FALSE))","v":"EVL110SX(DX)/А/40*40ANT/H.U003"},null,"1400х900/700х750",null,16382]
["EVL111SX(DX)/А/40*40",{"$f":"CONCATENATE(A30,VLOOKUP($I$4,'Цвет мет. опор'!A:B,2,0),\"/\",VLOOKUP($J$4,'Цвет лючка'!A:B,2,0),\".\",VLOOKUP($K$4,'Цвет столешницы'!A:B,2,FALSE))","v":"EVL111SX(DX)/А/40*40ANT/H.U003"},null,"1600х900/700х750",null,17192]
["EVL127SX(DX)/А/40*40/",{"$f":"CONCATENATE(A31,VLOOKUP($I$4,'Цвет мет. опор'!A:B,2,0),\"/\",VLOOKUP($J$4,'Цвет лючка'!A:B,2,0),\".\",VLOOKUP($K$4,'Цвет столешницы'!A:B,2,FALSE))","v":"EVL127SX(DX)/А/40*40/ANT/H.U003"},"Стол эргономичный левый/правый на А образном м/к 40х40, глубиной 600/1200 мм","1400*1200*750",null,30648]
["EVL128SX(DX)/А/40*40/",{"$f":"CONCATENATE(A32,VLOOKUP($I$4,'Цвет мет. опор'!A:B,2,0),\"/\",VLOOKUP($J$4,'Цвет лючка'!A:B,2,0),\".\",VLOOKUP($K$4,'Цвет столешницы'!A:B,2,FALSE))","v":"EVL128SX(DX)/А/40*40/ANT/H.U003"},null,"1600*1200*750",null,31547]
["EVL129SX(DX)/А/40*40/",{"$f":"CONCATENATE(A33,VLOOKUP($I$4,'Цвет мет. опор'!A:B,2,0),\"/\",VLOOKUP($J$4,'Цвет лючка'!A:B,2,0),\".\",VLOOKUP($K$4,'Цвет столешницы'!A:B,2,FALSE))","v":"EVL129SX(DX)/А/40*40/ANT/H.U003"},"Стол эргономичный левый/правый на А образном м/к 40х40, глубиной 700/1200 мм","1400*1200*750",null,30999]
["EVL130SX(DX)/А/40*40/",{"$f":"CONCATENATE(A34,VLOOKUP($I$4,'Цвет мет. опор'!A:B,2,0),\"/\",VLOOKUP($J$4,'Цвет лючка'!A:B,2,0),\".\",VLOOKUP($K$4,'Цвет столешницы'!A:B,2,FALSE))","v":"EVL130SX(DX)/А/40*40/ANT/H.U003"},null,"1600*1200*750",null,31890]
["EVL131SX(DX)/А/40*40/",{"$f":"CONCATENATE(A35,VLOOKUP($I$4,'Цвет мет. опор'!A:B,2,0),\"/\",VLOOKUP($J$4,'Цвет лючка'!A:B,2,0),\".\",VLOOKUP($K$4,'Цвет столешницы'!A:B,2,FALSE))","v":"EVL131SX(DX)/А/40*40/ANT/H.U003"},"Стол эргономичный левый/правый на А образном м/к 40х40, глубиной 800/1200 мм","1400*1200*750",null,31270]
["EVL132SX(DX)/А/40*40/",{"$f":"CONCATENATE(A36,VLOOKUP($I$4,'Цвет мет. опор'!A:B,2,0),\"/\",VLOOKUP($J$4,'Цвет лючка'!A:B,2,0),\".\",VLOOKUP($K$4,'Цвет столешницы'!A:B,2,FALSE))","v":"EVL132SX(DX)/А/40*40/ANT/H.U003"},null,"1600*1200*750",null,32086]
["EVL601/А/40*40/",{"$f":"CONCATENATE(A37,VLOOKUP($I$4,'Цвет мет. опор'!A:B,2,0),\"/\",VLOOKUP($J$4,'Цвет лючка'!A:B,2,0),\".\",VLOOKUP($K$4,'Цвет столешницы'!A:B,2,FALSE))","v":"EVL601/А/40*40/ANT/H.U003"},"Рабочая станция на А образном м/к 40х40, глубиной 1236 мм","1200*1236*750",null,31553]
["EVL602/А/40*40/",{"$f":"CONCATENATE(A38,VLOOKUP($I$4,'Цвет мет. опор'!A:B,2,0),\"/\",VLOOKUP($J$4,'Цвет лючка'!A:B,2,0),\".\",VLOOKUP($K$4,'Цвет столешницы'!A:B,2,FALSE))","v":"EVL602/А/40*40/ANT/H.U003"},null,"1400*1236*750",null,32502]
["EVL603/А/40*40/",{"$f":"CONCATENATE(A39,VLOOKUP($I$4,'Цвет мет. опор'!A:B,2,0),\"/\",VLOOKUP($J$4,'Цвет лючка'!A:B,2,0),\".\",VLOOKUP($K$4,'Цвет столешницы'!A:B,2,FALSE))","v":"EVL603/А/40*40/ANT/H.U003"},null,"1600*1236*750",null,34258]
["EVL681/А/40*40/",{"$f":"CONCATENATE(A40,VLOOKUP($I$4,'Цвет мет. опор'!A:B,2,0),\"/\",VLOOKUP($J$4,'Цвет лючка'!A:B,2,0),\".\",VLOOKUP($K$4,'Цвет столешницы'!A:B,2,FALSE))","v":"EVL681/А/40*40/ANT/H.U003"},null,"1800*1236*751",null,35957]
["EVL604/А/40*40/",{"$f":"CONCATENATE(A41,VLOOKUP($I$4,'Цвет мет. опор'!A:B,2,0),\"/\",VLOOKUP($J$4,'Цвет лючка'!A:B,2,0),\".\",VLOOKUP($K$4,'Цвет столешницы'!A:B,2,FALSE))","v":"EVL604/А/40*40/ANT/H.U003"},"Рабочая станция на А образном м/к 40х40 глубиной 1436","1200*1436*750",null,33014]
["EVL605/А/40*40/",{"$f":"CONCATENATE(A42,VLOOKUP($I$4,'Цвет мет. опор'!A:B,2,0),\"/\",VLOOKUP($J$4,'Цвет лючка'!A:B,2,0),\".\",VLOOKUP($K$4,'Цвет столешницы'!A:B,2,FALSE))","v":"EVL605/А/40*40/ANT/H.U003"},null,"1400*1436*750",null,34532]
["EVL606/А/40*40/",{"$f":"CONCATENATE(A43,VLOOKUP($I$4,'Цвет мет. опор'!A:B,2,0),\"/\",VLOOKUP($J$4,'Цвет лючка'!A:B,2,0),\".\",VLOOKUP($K$4,'Цвет столешницы'!A:B,2,FALSE))","v":"EVL606/А/40*40/ANT/H.U003"},null,"1600*1436*750",null,35813]
["EVL682/А/40*40/",{"$f":"CONCATENATE(A44,VLOOKUP($I$4,'Цвет мет. опор'!A:B,2,0),\"/\",VLOOKUP($J$4,'Цвет лючка'!A:B,2,0),\".\",VLOOKUP($K$4,'Цвет столешницы'!A:B,2,FALSE))","v":"EVL682/А/40*40/ANT/H.U003"},null,"1800*1436*751",null,37350]
["EVL607/А/40*40/",{"$f":"CONCATENATE(A45,VLOOKUP($I$4,'Цвет мет. опор'!A:B,2,0),\"/\",VLOOKUP($J$4,'Цвет лючка'!A:B,2,0),\".\",VLOOKUP($K$4,'Цвет столешницы'!A:B,2,FALSE))","v":"EVL607/А/40*40/ANT/H.U003"},"Рабочая станция на А образном м/к 40х40 глубиной 1636","1200*1636*750",null,34223]
["EVL608/А/40*40/",{"$f":"CONCATENATE(A46,VLOOKUP($I$4,'Цвет мет. опор'!A:B,2,0),\"/\",VLOOKUP($J$4,'Цвет лючка'!A:B,2,0),\".\",VLOOKUP($K$4,'Цвет столешницы'!A:B,2,FALSE))","v":"EVL608/А/40*40/ANT/H.U003"},null,"1400*1636*750",null,35986]
["EVL609/А/40*40/",{"$f":"CONCATENATE(A47,VLOOKUP($I$4,'Цвет мет. опор'!A:B,2,0),\"/\",VLOOKUP($J$4,'Цвет лючка'!A:B,2,0),\".\",VLOOKUP($K$4,'Цвет столешницы'!A:B,2,FALSE))","v":"EVL609/А/40*40/ANT/H.U003"},null,"1600*1636*750",null,37494]
["EVL683/А/40*40/",{"$f":"CONCATENATE(A48,VLOOKUP($I$4,'Цвет мет. опор'!A:B,2,0),\"/\",VLOOKUP($J$4,'Цвет лючка'!A:B,2,0),\".\",VLOOKUP($K$4,'Цвет столешницы'!A:B,2,FALSE))","v":"EVL683/А/40*40/ANT/H.U003"},null,"1800*1636*751",null,39289]
["EVL610/А/40*40/",{"$f":"CONCATENATE(A49,VLOOKUP($I$4,'Цвет мет. опор'!A:B,2,0),\"/\",VLOOKUP($J$4,'Цвет лючка'!A:B,2,0),\".\",VLOOKUP($K$4,'Цвет столешницы'!A:B,2,FALSE))","v":"EVL610/А/40*40/ANT/H.U003"},"Рабочая станция криволинейная на А образном м/к 40х40 глубиной 1236/1836","1200*1836*750",null,34055]
["EVL611/А/40*40/",{"$f":"CONCATENATE(A50,VLOOKUP($I$4,'Цвет мет. опор'!A:B,2,0),\"/\",VLOOKUP($J$4,'Цвет лючка'!A:B,2,0),\".\",VLOOKUP($K$4,'Цвет столешницы'!A:B,2,FALSE))","v":"EVL611/А/40*40/ANT/H.U003"},null,"1400*1836*750",null,35938]
["EVL612/А/40*40/",{"$f":"CONCATENATE(A51,VLOOKUP($I$4,'Цвет мет. опор'!A:B,2,0),\"/\",VLOOKUP($J$4,'Цвет лючка'!A:B,2,0),\".\",VLOOKUP($K$4,'Цвет столешницы'!A:B,2,FALSE))","v":"EVL612/А/40*40/ANT/H.U003"},null,"1600*1836*750",null,37357]
["EVL613/А/40*40/",{"$f":"CONCATENATE(A52,VLOOKUP($I$4,'Цвет мет. опор'!A:B,2,0),\"/\",VLOOKUP($J$4,'Цвет лючка'!A:B,2,0),\".\",VLOOKUP($K$4,'Цвет столешницы'!A:B,2,FALSE))","v":"EVL613/А/40*40/ANT/H.U003"},"Рабочая станция криволинейная  \nна А образном м/к 40х40 глубиной 1436/1836","1200*1836*750",null,33066]
["EVL614/А/40*40/",{"$f":"CONCATENATE(A53,VLOOKUP($I$4,'Цвет мет. опор'!A:B,2,0),\"/\",VLOOKUP($J$4,'Цвет лючка'!A:B,2,0),\".\",VLOOKUP($K$4,'Цвет столешницы'!A:B,2,FALSE))","v":"EVL614/А/40*40/ANT/H.U003"},null,"1400*1836*750",null,35218]
["EVL615/А/40*40/",{"$f":"CONCATENATE(A54,VLOOKUP($I$4,'Цвет мет. опор'!A:B,2,0),\"/\",VLOOKUP($J$4,'Цвет лючка'!A:B,2,0),\".\",VLOOKUP($K$4,'Цвет столешницы'!A:B,2,FALSE))","v":"EVL615/А/40*40/ANT/H.U003"},null,"1600*1836*750",null,36612]
["EVL616/А/40*40/",{"$f":"CONCATENATE(A55,VLOOKUP($I$4,'Цвет мет. опор'!A:B,2,0),\"/\",VLOOKUP($J$4,'Цвет лючка'!A:B,2,0),\".\",VLOOKUP($K$4,'Цвет столешницы'!A:B,2,FALSE))","v":"EVL616/А/40*40/ANT/H.U003"},"Рабочая станция эргономичная  \nна А образном м/к 40х40 глубиной 1236/2436","1400*2436*750",null,55849]
["EVL617/А/40*40/",{"$f":"CONCATENATE(A56,VLOOKUP($I$4,'Цвет мет. опор'!A:B,2,0),\"/\",VLOOKUP($J$4,'Цвет лючка'!A:B,2,0),\".\",VLOOKUP($K$4,'Цвет столешницы'!A:B,2,FALSE))","v":"EVL617/А/40*40/ANT/H.U003"},null,"1600*2436*750",null,57713]
["EVL618/А/40*40/",{"$f":"CONCATENATE(A57,VLOOKUP($I$4,'Цвет мет. опор'!A:B,2,0),\"/\",VLOOKUP($J$4,'Цвет лючка'!A:B,2,0),\".\",VLOOKUP($K$4,'Цвет столешницы'!A:B,2,FALSE))","v":"EVL618/А/40*40/ANT/H.U003"},"Рабочая станция эргономичная \nна А образном м/к 40х40 глубиной 1436/2436","1400*2440*750",null,56882]
["EVL619/А/40*40/",{"$f":"CONCATENATE(A58,VLOOKUP($I$4,'Цвет мет. опор'!A:B,2,0),\"/\",VLOOKUP($J$4,'Цвет лючка'!A:B,2,0),\".\",VLOOKUP($K$4,'Цвет столешницы'!A:B,2,FALSE))","v":"EVL619/А/40*40/ANT/H.U003"},null,"1600*2440*750",null,58797]
["EVL620/А/40*40/",{"$f":"CONCATENATE(A59,VLOOKUP($I$4,'Цвет мет. опор'!A:B,2,0),\"/\",VLOOKUP($J$4,'Цвет лючка'!A:B,2,0),\".\",VLOOKUP($K$4,'Цвет столешницы'!A:B,2,FALSE))","v":"EVL620/А/40*40/ANT/H.U003"},"Рабочая станция эргономичная \nна А образном м/к 40х40 глубиной 1636/2436","1400*2440*750",null,57343]
["EVL621/А/40*40/",{"$f":"CONCATENATE(A60,VLOOKUP($I$4,'Цвет мет. опор'!A:B,2,0),\"/\",VLOOKUP($J$4,'Цвет лючка'!A:B,2,0),\".\",VLOOKUP($K$4,'Цвет столешницы'!A:B,2,FALSE))","v":"EVL621/А/40*40/ANT/H.U003"},null,"1600*2440*750",null,59041]
["EVL622/А/40*40/",{"$f":"CONCATENATE(A61,VLOOKUP($I$4,'Цвет мет. опор'!A:B,2,0),\"/\",VLOOKUP($J$4,'Цвет лючка'!A:B,2,0),\".\",VLOOKUP($K$4,'Цвет столешницы'!A:B,2,FALSE))","v":"EVL622/А/40*40/ANT/H.U003"},"Рабочая станция эргономичная \nна А образном м/к 40х40 \nглубиной 600/900","2400*900*750",null,37025]
["EVL623/А/40*40/",{"$f":"CONCATENATE(A62,VLOOKUP($I$4,'Цвет мет. опор'!A:B,2,0),\"/\",VLOOKUP($J$4,'Цвет лючка'!A:B,2,0),\".\",VLOOKUP($K$4,'Цвет столешницы'!A:B,2,FALSE))","v":"EVL623/А/40*40/ANT/H.U003"},null,"2800*900*750",null,38908]
["EVL624/А/40*40/",{"$f":"CONCATENATE(A63,VLOOKUP($I$4,'Цвет мет. опор'!A:B,2,0),\"/\",VLOOKUP($J$4,'Цвет лючка'!A:B,2,0),\".\",VLOOKUP($K$4,'Цвет столешницы'!A:B,2,FALSE))","v":"EVL624/А/40*40/ANT/H.U003"},null,"3200*900*750",null,40327]
["EVL625/А/40*40/",{"$f":"CONCATENATE(A64,VLOOKUP($I$4,'Цвет мет. опор'!A:B,2,0),\"/\",VLOOKUP($J$4,'Цвет лючка'!A:B,2,0),\".\",VLOOKUP($K$4,'Цвет столешницы'!A:B,2,FALSE))","v":"EVL625/А/40*40/ANT/H.U003"},"Рабочая станция эргономичная \nна А образном м/к 40х40 \nглубиной 700/900","2400*900*750",null,36116]
["EVL626/А/40*40/",{"$f":"CONCATENATE(A65,VLOOKUP($I$4,'Цвет мет. опор'!A:B,2,0),\"/\",VLOOKUP($J$4,'Цвет лючка'!A:B,2,0),\".\",VLOOKUP($K$4,'Цвет столешницы'!A:B,2,FALSE))","v":"EVL626/А/40*40/ANT/H.U003"},null,"2800*900*750",null,38268]
["EVL627/А/40*40/",{"$f":"CONCATENATE(A66,VLOOKUP($I$4,'Цвет мет. опор'!A:B,2,0),\"/\",VLOOKUP($J$4,'Цвет лючка'!A:B,2,0),\".\",VLOOKUP($K$4,'Цвет столешницы'!A:B,2,FALSE))","v":"EVL627/А/40*40/ANT/H.U003"},null,"3200*900*750",null,39663]
["EVL628/А/40*40/",{"$f":"CONCATENATE(A67,VLOOKUP($I$4,'Цвет мет. опор'!A:B,2,0),\"/\",VLOOKUP($J$4,'Цвет лючка'!A:B,2,0),\".\",VLOOKUP($K$4,'Цвет столешницы'!A:B,2,FALSE))","v":"EVL628/А/40*40/ANT/H.U003"},"Рабочая станция эргономичная  \nна А образном м/к 40х40 \nглубиной 800/900","2400*900*750",null,37633]
["EVL629/А/40*40/",{"$f":"CONCATENATE(A68,VLOOKUP($I$4,'Цвет мет. опор'!A:B,2,0),\"/\",VLOOKUP($J$4,'Цвет лючка'!A:B,2,0),\".\",VLOOKUP($K$4,'Цвет столешницы'!A:B,2,FALSE))","v":"EVL629/А/40*40/ANT/H.U003"},null,"2800*900*750",null,39470]
["EVL630/А/40*40/",{"$f":"CONCATENATE(A69,VLOOKUP($I$4,'Цвет мет. опор'!A:B,2,0),\"/\",VLOOKUP($J$4,'Цвет лючка'!A:B,2,0),\".\",VLOOKUP($K$4,'Цвет столешницы'!A:B,2,FALSE))","v":"EVL630/А/40*40/ANT/H.U003"},null,"3200*900*750",null,40862]
["EVL631/А/40*40/",{"$f":"CONCATENATE(A70,VLOOKUP($I$4,'Цвет мет. опор'!A:B,2,0),\"/\",VLOOKUP($J$4,'Цвет лючка'!A:B,2,0),\".\",VLOOKUP($K$4,'Цвет столешницы'!A:B,2,FALSE))","v":"EVL631/А/40*40/ANT/H.U003"},"Рабочая станция эргономичная на А образном м/к 40х40 \nглубиной 600/1200","2400*1236*750","промежуточная опора 1236",39406]
["EVL632/А/40*40/",{"$f":"CONCATENATE(A71,VLOOKUP($I$4,'Цвет мет. опор'!A:B,2,0),\"/\",VLOOKUP($J$4,'Цвет лючка'!A:B,2,0),\".\",VLOOKUP($K$4,'Цвет столешницы'!A:B,2,FALSE))","v":"EVL632/А/40*40/ANT/H.U003"},null,"2800*1236*750",null,41389]
["EVL633/А/40*40/",{"$f":"CONCATENATE(A72,VLOOKUP($I$4,'Цвет мет. опор'!A:B,2,0),\"/\",VLOOKUP($J$4,'Цвет лючка'!A:B,2,0),\".\",VLOOKUP($K$4,'Цвет столешницы'!A:B,2,FALSE))","v":"EVL633/А/40*40/ANT/H.U003"},null,"3200*1236*750",null,43186]
["EVL634/А/40*40/",{"$f":"CONCATENATE(A73,VLOOKUP($I$4,'Цвет мет. опор'!A:B,2,0),\"/\",VLOOKUP($J$4,'Цвет лючка'!A:B,2,0),\".\",VLOOKUP($K$4,'Цвет столешницы'!A:B,2,FALSE))","v":"EVL634/А/40*40/ANT/H.U003"},"Рабочая станция эргономичная  \nна А образном м/к 40х40 \nглубиной 700/1200","2400*1200*750","промежуточная опора 700",40101]
["EVL635/А/40*40/",{"$f":"CONCATENATE(A74,VLOOKUP($I$4,'Цвет мет. опор'!A:B,2,0),\"/\",VLOOKUP($J$4,'Цвет лючка'!A:B,2,0),\".\",VLOOKUP($K$4,'Цвет столешницы'!A:B,2,FALSE))","v":"EVL635/А/40*40/ANT/H.U003"},null,"2800*1200*750",null,42391]
["EVL636/А/40*40/",{"$f":"CONCATENATE(A75,VLOOKUP($I$4,'Цвет мет. опор'!A:B,2,0),\"/\",VLOOKUP($J$4,'Цвет лючка'!A:B,2,0),\".\",VLOOKUP($K$4,'Цвет столешницы'!A:B,2,FALSE))","v":"EVL636/А/40*40/ANT/H.U003"},null,"3200*1200*750",null,44173]
["EVL637/А/40*40/",{"$f":"CONCATENATE(A76,VLOOKUP($I$4,'Цвет мет. опор'!A:B,2,0),\"/\",VLOOKUP($J$4,'Цвет лючка'!A:B,2,0),\".\",VLOOKUP($K$4,'Цвет столешницы'!A:B,2,FALSE))","v":"EVL637/А/40*40/ANT/H.U003"},"Рабочая станция эргономичная на А образном м/к 40х40 \nглубиной 800/1200","2400*1200*750","промежуточная опора 800",40255]
["EVL638/А/40*40/",{"$f":"CONCATENATE(A77,VLOOKUP($I$4,'Цвет мет. опор'!A:B,2,0),\"/\",VLOOKUP($J$4,'Цвет лючка'!A:B,2,0),\".\",VLOOKUP($K$4,'Цвет столешницы'!A:B,2,FALSE))","v":"EVL638/А/40*40/ANT/H.U003"},null,"2800*1200*750",null,42677]
["EVL639/А/40*40/",{"$f":"CONCATENATE(A78,VLOOKUP($I$4,'Цвет мет. опор'!A:B,2,0),\"/\",VLOOKUP($J$4,'Цвет лючка'!A:B,2,0),\".\",VLOOKUP($K$4,'Цвет столешницы'!A:B,2,FALSE))","v":"EVL639/А/40*40/ANT/H.U003"},null,"3200*1200*750",null,44309]
["EVL180/А/40*40/",{"$f":"CONCATENATE(A79,VLOOKUP($I$4,'Цвет мет. опор'!A:B,2,0),\"/\",VLOOKUP($J$4,'Цвет лючка'!A:B,2,0),\".\",VLOOKUP($K$4,'Цвет столешницы'!A:B,2,FALSE))","v":"EVL180/А/40*40/ANT/H.U003"},"Приставка к столу рабочая 1000х500","1000x500x750",null,11712]
["EVL135/А/40*40/",{"$f":"CONCATENATE(A80,VLOOKUP($I$4,'Цвет мет. опор'!A:B,2,0),\"/\",VLOOKUP($J$4,'Цвет лючка'!A:B,2,0),\".\",VLOOKUP($K$4,'Цвет столешницы'!A:B,2,FALSE))","v":"EVL135/А/40*40/ANT/H.U003"},"Приставной элемент \nна А образном м/к 40х40 \nглуб. 700 (используется в качестве брифинга)","1000*600*750",null,13733]
["EVL137/А/40*40/",{"$f":"CONCATENATE(A81,VLOOKUP($I$4,'Цвет мет. опор'!A:B,2,0),\"/\",VLOOKUP($J$4,'Цвет лючка'!A:B,2,0),\".\",VLOOKUP($K$4,'Цвет столешницы'!A:B,2,FALSE))","v":"EVL137/А/40*40/ANT/H.U003"},null,"1200*700*750",null,15184]
["EVL701/А/40*40/",{"$f":"CONCATENATE(A82,VLOOKUP($I$4,'Цвет мет. опор'!A:B,2,0),\"/\",VLOOKUP($J$4,'Цвет лючка'!A:B,2,0),\".\",VLOOKUP($K$4,'Цвет столешницы'!A:B,2,FALSE))","v":"EVL701/А/40*40/ANT/H.U003"},"Рабочая станция на А образном м/к 40х40 с тумбой \n(композиция стол+тумба)","1450*700*750","Тумба 450х700х750",33567]
["EVL702/А/40*40/",{"$f":"CONCATENATE(A83,VLOOKUP($I$4,'Цвет мет. опор'!A:B,2,0),\"/\",VLOOKUP($J$4,'Цвет лючка'!A:B,2,0),\".\",VLOOKUP($K$4,'Цвет столешницы'!A:B,2,FALSE))","v":"EVL702/А/40*40/ANT/H.U003"},null,"1650*700*750",null,34431]
["EVL703/А/40*40/",{"$f":"CONCATENATE(A84,VLOOKUP($I$4,'Цвет мет. опор'!A:B,2,0),\"/\",VLOOKUP($J$4,'Цвет лючка'!A:B,2,0),\".\",VLOOKUP($K$4,'Цвет столешницы'!A:B,2,FALSE))","v":"EVL703/А/40*40/ANT/H.U003"},null,"1850*700*750",null,35190]
["EVL704/А/40*40/",{"$f":"CONCATENATE(A85,VLOOKUP($I$4,'Цвет мет. опор'!A:B,2,0),\"/\",VLOOKUP($J$4,'Цвет лючка'!A:B,2,0),\".\",VLOOKUP($K$4,'Цвет столешницы'!A:B,2,FALSE))","v":"EVL704/А/40*40/ANT/H.U003"},null,"2050*700*750",null,35831]
["EVL705/А/40*40/",{"$f":"CONCATENATE(A86,VLOOKUP($I$4,'Цвет мет. опор'!A:B,2,0),\"/\",VLOOKUP($J$4,'Цвет лючка'!A:B,2,0),\".\",VLOOKUP($K$4,'Цвет столешницы'!A:B,2,FALSE))","v":"EVL705/А/40*40/ANT/H.U003"},null,"2250*700*750",null,36600]
["EVL706/А/40*40/",{"$f":"CONCATENATE(A87,VLOOKUP($I$4,'Цвет мет. опор'!A:B,2,0),\"/\",VLOOKUP($J$4,'Цвет лючка'!A:B,2,0),\".\",VLOOKUP($K$4,'Цвет столешницы'!A:B,2,FALSE))","v":"EVL706/А/40*40/ANT/H.U003"},"Рабочая станция на А образном м/к 40х40 с тумбой \n(композиция двойной бенч+тумба)","1450*1436*750","Тумба  450х1436х750",57845]
["EVL707/А/40*40/",{"$f":"CONCATENATE(A88,VLOOKUP($I$4,'Цвет мет. опор'!A:B,2,0),\"/\",VLOOKUP($J$4,'Цвет лючка'!A:B,2,0),\".\",VLOOKUP($K$4,'Цвет столешницы'!A:B,2,FALSE))","v":"EVL707/А/40*40/ANT/H.U003"},null,"1650*1436*750",null,59574]
["EVL708/А/40*40/",{"$f":"CONCATENATE(A89,VLOOKUP($I$4,'Цвет мет. опор'!A:B,2,0),\"/\",VLOOKUP($J$4,'Цвет лючка'!A:B,2,0),\".\",VLOOKUP($K$4,'Цвет столешницы'!A:B,2,FALSE))","v":"EVL708/А/40*40/ANT/H.U003"},null,"1850*1436*750",null,61092]
["EVL709/А/40*40/",{"$f":"CONCATENATE(A90,VLOOKUP($I$4,'Цвет мет. опор'!A:B,2,0),\"/\",VLOOKUP($J$4,'Цвет лючка'!A:B,2,0),\".\",VLOOKUP($K$4,'Цвет столешницы'!A:B,2,FALSE))","v":"EVL709/А/40*40/ANT/H.U003"},null,"2050*1436*750",null,62373]
["EVL710/А/40*40/",{"$f":"CONCATENATE(A91,VLOOKUP($I$4,'Цвет мет. опор'!A:B,2,0),\"/\",VLOOKUP($J$4,'Цвет лючка'!A:B,2,0),\".\",VLOOKUP($K$4,'Цвет столешницы'!A:B,2,FALSE))","v":"EVL710/А/40*40/ANT/H.U003"},null,"2250*1436*750",null,63911]
["EVL711/А/40*40/",{"$f":"CONCATENATE(A92,VLOOKUP($I$4,'Цвет мет. опор'!A:B,2,0),\"/\",VLOOKUP($J$4,'Цвет лючка'!A:B,2,0),\".\",VLOOKUP($K$4,'Цвет столешницы'!A:B,2,FALSE))","v":"EVL711/А/40*40/ANT/H.U003"},"Рабочая станция на А образном м/к 40х40 со шкафом-купе\n(композиция двойной бенч+шкаф-купе)","1410*1436*750","Шкаф-купе приставной 1440х410х750",51749]
["EVL712/А/40*40/",{"$f":"CONCATENATE(A93,VLOOKUP($I$4,'Цвет мет. опор'!A:B,2,0),\"/\",VLOOKUP($J$4,'Цвет лючка'!A:B,2,0),\".\",VLOOKUP($K$4,'Цвет столешницы'!A:B,2,FALSE))","v":"EVL712/А/40*40/ANT/H.U003"},null,"1610*1436*750",null,53478]
["EVL713/А/40*40/",{"$f":"CONCATENATE(A94,VLOOKUP($I$4,'Цвет мет. опор'!A:B,2,0),\"/\",VLOOKUP($J$4,'Цвет лючка'!A:B,2,0),\".\",VLOOKUP($K$4,'Цвет столешницы'!A:B,2,FALSE))","v":"EVL713/А/40*40/ANT/H.U003"},null,"1810*1436*750",null,54996]
["EVL714/А/40*40/",{"$f":"CONCATENATE(A95,VLOOKUP($I$4,'Цвет мет. опор'!A:B,2,0),\"/\",VLOOKUP($J$4,'Цвет лючка'!A:B,2,0),\".\",VLOOKUP($K$4,'Цвет столешницы'!A:B,2,FALSE))","v":"EVL714/А/40*40/ANT/H.U003"},null,"2010*1436*750",null,56277]
["EVL715/А/40*40/",{"$f":"CONCATENATE(A96,VLOOKUP($I$4,'Цвет мет. опор'!A:B,2,0),\"/\",VLOOKUP($J$4,'Цвет лючка'!A:B,2,0),\".\",VLOOKUP($K$4,'Цвет столешницы'!A:B,2,FALSE))","v":"EVL715/А/40*40/ANT/H.U003"},null,"2210*1436*750",null,57815]
["EVL716/А/40*40/",{"$f":"CONCATENATE(A97,VLOOKUP($I$4,'Цвет мет. опор'!A:B,2,0),\"/\",VLOOKUP($J$4,'Цвет лючка'!A:B,2,0),\".\",VLOOKUP($K$4,'Цвет столешницы'!A:B,2,FALSE))","v":"EVL716/А/40*40/ANT/H.U003"},"Рабочая станция на А образном м/к 40х40 со шкафом-купе\n(композиция двойной бенч+шкаф-купе)","1410*1436*1098","Шкаф-купе приставной  1440х410х1098",56611]
["EVL717/А/40*40/",{"$f":"CONCATENATE(A98,VLOOKUP($I$4,'Цвет мет. опор'!A:B,2,0),\"/\",VLOOKUP($J$4,'Цвет лючка'!A:B,2,0),\".\",VLOOKUP($K$4,'Цвет столешницы'!A:B,2,FALSE))","v":"EVL717/А/40*40/ANT/H.U003"},null,"1610*1436*1098",null,58340]
["EVL718/А/40*40/",{"$f":"CONCATENATE(A99,VLOOKUP($I$4,'Цвет мет. опор'!A:B,2,0),\"/\",VLOOKUP($J$4,'Цвет лючка'!A:B,2,0),\".\",VLOOKUP($K$4,'Цвет столешницы'!A:B,2,FALSE))","v":"EVL718/А/40*40/ANT/H.U003"},null,"1810*1436*1098",null,59858]
["EVL719/А/40*40/",{"$f":"CONCATENATE(A100,VLOOKUP($I$4,'Цвет мет. опор'!A:B,2,0),\"/\",VLOOKUP($J$4,'Цвет лючка'!A:B,2,0),\".\",VLOOKUP($K$4,'Цвет столешницы'!A:B,2,FALSE))","v":"EVL719/А/40*40/ANT/H.U003"},null,"2010*1436*1098",null,61139]
["EVL720/А/40*40/",{"$f":"CONCATENATE(A101,VLOOKUP($I$4,'Цвет мет. опор'!A:B,2,0),\"/\",VLOOKUP($J$4,'Цвет лючка'!A:B,2,0),\".\",VLOOKUP($K$4,'Цвет столешницы'!A:B,2,FALSE))","v":"EVL720/А/40*40/ANT/H.U003"},null,"2210*1436*1098",null,62677]
["EVL721/А/40*40/",{"$f":"CONCATENATE(A102,VLOOKUP($I$4,'Цвет мет. опор'!A:B,2,0),\"/\",VLOOKUP($J$4,'Цвет лючка'!A:B,2,0),\".\",VLOOKUP($K$4,'Цвет столешницы'!A:B,2,FALSE))","v":"EVL721/А/40*40/ANT/H.U003"},"Стол письменный на А образном м/к 40х40 со шкафом-купе\n(композиция двойной бенч+шкаф-купе)","1410*1240*1098","Шкаф-купе приставной  1240х410х1098",41298]
["EVL722/А/40*40/",{"$f":"CONCATENATE(A103,VLOOKUP($I$4,'Цвет мет. опор'!A:B,2,0),\"/\",VLOOKUP($J$4,'Цвет лючка'!A:B,2,0),\".\",VLOOKUP($K$4,'Цвет столешницы'!A:B,2,FALSE))","v":"EVL722/А/40*40/ANT/H.U003"},null,"1610*1240*1098",null,42162]
["EVL723/А/40*40/",{"$f":"CONCATENATE(A104,VLOOKUP($I$4,'Цвет мет. опор'!A:B,2,0),\"/\",VLOOKUP($J$4,'Цвет лючка'!A:B,2,0),\".\",VLOOKUP($K$4,'Цвет столешницы'!A:B,2,FALSE))","v":"EVL723/А/40*40/ANT/H.U003"},null,"1810*1240*1098",null,42921]
["EVL724/А/40*40/",{"$f":"CONCATENATE(A105,VLOOKUP($I$4,'Цвет мет. опор'!A:B,2,0),\"/\",VLOOKUP($J$4,'Цвет лючка'!A:B,2,0),\".\",VLOOKUP($K$4,'Цвет столешницы'!A:B,2,FALSE))","v":"EVL724/А/40*40/ANT/H.U003"},null,"2010*1240*1098",null,43562]
["EVL725/А/40*40/",{"$f":"CONCATENATE(A106,VLOOKUP($I$4,'Цвет мет. опор'!A:B,2,0),\"/\",VLOOKUP($J$4,'Цвет лючка'!A:B,2,0),\".\",VLOOKUP($K$4,'Цвет столешницы'!A:B,2,FALSE))","v":"EVL725/А/40*40/ANT/H.U003"},null,"2210*1240*1098",null,44330]
["EVL726/А/40*40/",{"$f":"CONCATENATE(A107,VLOOKUP($I$4,'Цвет мет. опор'!A:B,2,0),\"/\",VLOOKUP($J$4,'Цвет лючка'!A:B,2,0),\".\",VLOOKUP($K$4,'Цвет столешницы'!A:B,2,FALSE))","v":"EVL726/А/40*40/ANT/H.U003"},"Рабочая станция на А образном м/к 40х40 со шкафом-купе\n(композиция двойной бенч+шкаф-купе)","1410*2332*1098","Шкаф-купе приставной \n2332х410х1098",80258]
["EVL727/А/40*40/",{"$f":"CONCATENATE(A108,VLOOKUP($I$4,'Цвет мет. опор'!A:B,2,0),\"/\",VLOOKUP($J$4,'Цвет лючка'!A:B,2,0),\".\",VLOOKUP($K$4,'Цвет столешницы'!A:B,2,FALSE))","v":"EVL727/А/40*40/ANT/H.U003"},null,"1610*2332*1098",null,81987]
["EVL728/А/40*40/",{"$f":"CONCATENATE(A109,VLOOKUP($I$4,'Цвет мет. опор'!A:B,2,0),\"/\",VLOOKUP($J$4,'Цвет лючка'!A:B,2,0),\".\",VLOOKUP($K$4,'Цвет столешницы'!A:B,2,FALSE))","v":"EVL728/А/40*40/ANT/H.U003"},null,"1810*2332*1098",null,83505]
["EVL729/А/40*40/",{"$f":"CONCATENATE(A110,VLOOKUP($I$4,'Цвет мет. опор'!A:B,2,0),\"/\",VLOOKUP($J$4,'Цвет лючка'!A:B,2,0),\".\",VLOOKUP($K$4,'Цвет столешницы'!A:B,2,FALSE))","v":"EVL729/А/40*40/ANT/H.U003"},null,"2010*2332*1098",null,84786]
["EVL730/А/40*40/",{"$f":"CONCATENATE(A111,VLOOKUP($I$4,'Цвет мет. опор'!A:B,2,0),\"/\",VLOOKUP($J$4,'Цвет лючка'!A:B,2,0),\".\",VLOOKUP($K$4,'Цвет столешницы'!A:B,2,FALSE))","v":"EVL730/А/40*40/ANT/H.U003"},null,"2210*2332*1098",null,86323]
["Бэнч-системы"]
["EVL645/А/40*40/",{"$f":"CONCATENATE(A113,VLOOKUP($I$4,'Цвет мет. опор'!A:B,2,0),\"/\",VLOOKUP($J$4,'Цвет лючка'!A:B,2,0),\".\",VLOOKUP($K$4,'Цвет столешницы'!A:B,2,FALSE))","v":"EVL645/А/40*40/ANT/H.U003"},"Рабочая станция на 2 раб.места на А образном м/к 40х40 (бенч-система) глубиной 600","2400*600*750",null,34523]
["EVL646/А/40*40/",{"$f":"CONCATENATE(A114,VLOOKUP($I$4,'Цвет мет. опор'!A:B,2,0),\"/\",VLOOKUP($J$4,'Цвет лючка'!A:B,2,0),\".\",VLOOKUP($K$4,'Цвет столешницы'!A:B,2,FALSE))","v":"EVL646/А/40*40/ANT/H.U003"},null,"2800*600*750",null,35472]
["EVL647/А/40*40/",{"$f":"CONCATENATE(A115,VLOOKUP($I$4,'Цвет мет. опор'!A:B,2,0),\"/\",VLOOKUP($J$4,'Цвет лючка'!A:B,2,0),\".\",VLOOKUP($K$4,'Цвет столешницы'!A:B,2,FALSE))","v":"EVL647/А/40*40/ANT/H.U003"},null,"3200*600*750",null,37228]
["EVL648/А/40*40/",{"$f":"CONCATENATE(A116,VLOOKUP($I$4,'Цвет мет. опор'!A:B,2,0),\"/\",VLOOKUP($J$4,'Цвет лючка'!A:B,2,0),\".\",VLOOKUP($K$4,'Цвет столешницы'!A:B,2,FALSE))","v":"EVL648/А/40*40/ANT/H.U003"},"Рабочая станция на 2 раб.места на А образном м/к 40х40 (бенч-система) глубиной 700","2400*700*750",null,35870]
["EVL649/А/40*40/",{"$f":"CONCATENATE(A117,VLOOKUP($I$4,'Цвет мет. опор'!A:B,2,0),\"/\",VLOOKUP($J$4,'Цвет лючка'!A:B,2,0),\".\",VLOOKUP($K$4,'Цвет столешницы'!A:B,2,FALSE))","v":"EVL649/А/40*40/ANT/H.U003"},null,"2800*700*750",null,37569]
["EVL650/А/40*40/",{"$f":"CONCATENATE(A118,VLOOKUP($I$4,'Цвет мет. опор'!A:B,2,0),\"/\",VLOOKUP($J$4,'Цвет лючка'!A:B,2,0),\".\",VLOOKUP($K$4,'Цвет столешницы'!A:B,2,FALSE))","v":"EVL650/А/40*40/ANT/H.U003"},null,"3200*700*750",null,38671]
["EVL651/А/40*40/",{"$f":"CONCATENATE(A119,VLOOKUP($I$4,'Цвет мет. опор'!A:B,2,0),\"/\",VLOOKUP($J$4,'Цвет лючка'!A:B,2,0),\".\",VLOOKUP($K$4,'Цвет столешницы'!A:B,2,FALSE))","v":"EVL651/А/40*40/ANT/H.U003"},"Рабочая станция на 2 раб.места на А образном м/к 40х40 (бенч-система) глубиной 800","2400*800*750",null,36680]
["EVL652/А/40*40/",{"$f":"CONCATENATE(A120,VLOOKUP($I$4,'Цвет мет. опор'!A:B,2,0),\"/\",VLOOKUP($J$4,'Цвет лючка'!A:B,2,0),\".\",VLOOKUP($K$4,'Цвет столешницы'!A:B,2,FALSE))","v":"EVL652/А/40*40/ANT/H.U003"},null,"2800*800*750",null,38442]
["EVL653/А/40*40/",{"$f":"CONCATENATE(A121,VLOOKUP($I$4,'Цвет мет. опор'!A:B,2,0),\"/\",VLOOKUP($J$4,'Цвет лючка'!A:B,2,0),\".\",VLOOKUP($K$4,'Цвет столешницы'!A:B,2,FALSE))","v":"EVL653/А/40*40/ANT/H.U003"},null,"3200*800*750",null,39950]
["EVL654/А/40*40/",{"$f":"CONCATENATE(A122,VLOOKUP($I$4,'Цвет мет. опор'!A:B,2,0),\"/\",VLOOKUP($J$4,'Цвет лючка'!A:B,2,0),\".\",VLOOKUP($K$4,'Цвет столешницы'!A:B,2,FALSE))","v":"EVL654/А/40*40/ANT/H.U003"},"Рабочая станция на 3 раб.места на А образном м/к 40х40 (бенч-система), глубиной 600 мм","3600*600*750",null,50607]
["EVL655/А/40*40/",{"$f":"CONCATENATE(A123,VLOOKUP($I$4,'Цвет мет. опор'!A:B,2,0),\"/\",VLOOKUP($J$4,'Цвет лючка'!A:B,2,0),\".\",VLOOKUP($K$4,'Цвет столешницы'!A:B,2,FALSE))","v":"EVL655/А/40*40/ANT/H.U003"},null,"4200*600*750",null,52032]
["EVL656/А/40*40/",{"$f":"CONCATENATE(A124,VLOOKUP($I$4,'Цвет мет. опор'!A:B,2,0),\"/\",VLOOKUP($J$4,'Цвет лючка'!A:B,2,0),\".\",VLOOKUP($K$4,'Цвет столешницы'!A:B,2,FALSE))","v":"EVL656/А/40*40/ANT/H.U003"},null,"4800*600*750",null,54665]
["EVL657/А/40*40/",{"$f":"CONCATENATE(A125,VLOOKUP($I$4,'Цвет мет. опор'!A:B,2,0),\"/\",VLOOKUP($J$4,'Цвет лючка'!A:B,2,0),\".\",VLOOKUP($K$4,'Цвет столешницы'!A:B,2,FALSE))","v":"EVL657/А/40*40/ANT/H.U003"},"Рабочая станция на 3 раб.места на А образном м/к 40х40 (бенч-система), глубиной 700 мм","3600*700*750",null,52915]
["EVL658/А/40*40/",{"$f":"CONCATENATE(A126,VLOOKUP($I$4,'Цвет мет. опор'!A:B,2,0),\"/\",VLOOKUP($J$4,'Цвет лючка'!A:B,2,0),\".\",VLOOKUP($K$4,'Цвет столешницы'!A:B,2,FALSE))","v":"EVL658/А/40*40/ANT/H.U003"},null,"4200*700*750",null,55192]
["EVL659/А/40*40/",{"$f":"CONCATENATE(A127,VLOOKUP($I$4,'Цвет мет. опор'!A:B,2,0),\"/\",VLOOKUP($J$4,'Цвет лючка'!A:B,2,0),\".\",VLOOKUP($K$4,'Цвет столешницы'!A:B,2,FALSE))","v":"EVL659/А/40*40/ANT/H.U003"},null,"4800*700*750",null,57113]
["EVL660/А/40*40/",{"$f":"CONCATENATE(A128,VLOOKUP($I$4,'Цвет мет. опор'!A:B,2,0),\"/\",VLOOKUP($J$4,'Цвет лючка'!A:B,2,0),\".\",VLOOKUP($K$4,'Цвет столешницы'!A:B,2,FALSE))","v":"EVL660/А/40*40/ANT/H.U003"},"Рабочая станция на 3 раб.места на А образном м/к 40х40 (бенч-система), глубиной 800 мм","3600*800*750",null,53420]
["EVL661/А/40*40/",{"$f":"CONCATENATE(A129,VLOOKUP($I$4,'Цвет мет. опор'!A:B,2,0),\"/\",VLOOKUP($J$4,'Цвет лючка'!A:B,2,0),\".\",VLOOKUP($K$4,'Цвет столешницы'!A:B,2,FALSE))","v":"EVL661/А/40*40/ANT/H.U003"},null,"4200*800*750",null,56335]
["EVL662/А/40*40/",{"$f":"CONCATENATE(A130,VLOOKUP($I$4,'Цвет мет. опор'!A:B,2,0),\"/\",VLOOKUP($J$4,'Цвет лючка'!A:B,2,0),\".\",VLOOKUP($K$4,'Цвет столешницы'!A:B,2,FALSE))","v":"EVL662/А/40*40/ANT/H.U003"},null,"4800*800*750",null,58330]
["EVL663/А/40*40/",{"$f":"CONCATENATE(A131,VLOOKUP($I$4,'Цвет мет. опор'!A:B,2,0),\"/\",VLOOKUP($J$4,'Цвет лючка'!A:B,2,0),\".\",VLOOKUP($K$4,'Цвет столешницы'!A:B,2,FALSE))","v":"EVL663/А/40*40/ANT/H.U003"},"Рабочая станция на 4 раб.места на А образном м/к 40х40 с шириной 1-го рабочего места 600 мм","2400*1236*750",null,60224]
["EVL664/А/40*40/",{"$f":"CONCATENATE(A132,VLOOKUP($I$4,'Цвет мет. опор'!A:B,2,0),\"/\",VLOOKUP($J$4,'Цвет лючка'!A:B,2,0),\".\",VLOOKUP($K$4,'Цвет столешницы'!A:B,2,FALSE))","v":"EVL664/А/40*40/ANT/H.U003"},null,"2800*1236*750",null,62123]
["EVL665/А/40*40/",{"$f":"CONCATENATE(A133,VLOOKUP($I$4,'Цвет мет. опор'!A:B,2,0),\"/\",VLOOKUP($J$4,'Цвет лючка'!A:B,2,0),\".\",VLOOKUP($K$4,'Цвет столешницы'!A:B,2,FALSE))","v":"EVL665/А/40*40/ANT/H.U003"},null,"3200*1236*750",null,65633]
["EVL666/А/40*40/",{"$f":"CONCATENATE(A134,VLOOKUP($I$4,'Цвет мет. опор'!A:B,2,0),\"/\",VLOOKUP($J$4,'Цвет лючка'!A:B,2,0),\".\",VLOOKUP($K$4,'Цвет столешницы'!A:B,2,FALSE))","v":"EVL666/А/40*40/ANT/H.U003"},"Рабочая станция на 4 раб.места на А образном м/к 40х40 с шириной 1-го рабочего места 700 мм","2400*1436*750",null,62497]
["EVL667/А/40*40/",{"$f":"CONCATENATE(A135,VLOOKUP($I$4,'Цвет мет. опор'!A:B,2,0),\"/\",VLOOKUP($J$4,'Цвет лючка'!A:B,2,0),\".\",VLOOKUP($K$4,'Цвет столешницы'!A:B,2,FALSE))","v":"EVL667/А/40*40/ANT/H.U003"},null,"2800*1436*750",null,65893]
["EVL668/А/40*40/",{"$f":"CONCATENATE(A136,VLOOKUP($I$4,'Цвет мет. опор'!A:B,2,0),\"/\",VLOOKUP($J$4,'Цвет лючка'!A:B,2,0),\".\",VLOOKUP($K$4,'Цвет столешницы'!A:B,2,FALSE))","v":"EVL668/А/40*40/ANT/H.U003"},null,"3200*1436*750",null,68098]
["EVL669/А/40*40/",{"$f":"CONCATENATE(A137,VLOOKUP($I$4,'Цвет мет. опор'!A:B,2,0),\"/\",VLOOKUP($J$4,'Цвет лючка'!A:B,2,0),\".\",VLOOKUP($K$4,'Цвет столешницы'!A:B,2,FALSE))","v":"EVL669/А/40*40/ANT/H.U003"},"Рабочая станция на 4 раб.места на А образном м/к 40х40 с шириной 1-го рабочего места 800 мм","2400*1636*750",null,64769]
["EVL670/А/40*40/",{"$f":"CONCATENATE(A138,VLOOKUP($I$4,'Цвет мет. опор'!A:B,2,0),\"/\",VLOOKUP($J$4,'Цвет лючка'!A:B,2,0),\".\",VLOOKUP($K$4,'Цвет столешницы'!A:B,2,FALSE))","v":"EVL670/А/40*40/ANT/H.U003"},null,"2800*1636*750",null,68294]
["EVL671/А/40*40/",{"$f":"CONCATENATE(A139,VLOOKUP($I$4,'Цвет мет. опор'!A:B,2,0),\"/\",VLOOKUP($J$4,'Цвет лючка'!A:B,2,0),\".\",VLOOKUP($K$4,'Цвет столешницы'!A:B,2,FALSE))","v":"EVL671/А/40*40/ANT/H.U003"},null,"3200*1636*750",null,71311]
["EVL672/А/40*40/",{"$f":"CONCATENATE(A140,VLOOKUP($I$4,'Цвет мет. опор'!A:B,2,0),\"/\",VLOOKUP($J$4,'Цвет лючка'!A:B,2,0),\".\",VLOOKUP($K$4,'Цвет столешницы'!A:B,2,FALSE))","v":"EVL672/А/40*40/ANT/H.U003"},"Рабочая станция на 6 раб.места на А образном м/к 40х40 с шириной 1-го рабочего места 600 мм","3600*1236*750",null,88895]
["EVL673/А/40*40/",{"$f":"CONCATENATE(A141,VLOOKUP($I$4,'Цвет мет. опор'!A:B,2,0),\"/\",VLOOKUP($J$4,'Цвет лючка'!A:B,2,0),\".\",VLOOKUP($K$4,'Цвет столешницы'!A:B,2,FALSE))","v":"EVL673/А/40*40/ANT/H.U003"},null,"4200*1236*750",null,91743]
["EVL674/А/40*40/",{"$f":"CONCATENATE(A142,VLOOKUP($I$4,'Цвет мет. опор'!A:B,2,0),\"/\",VLOOKUP($J$4,'Цвет лючка'!A:B,2,0),\".\",VLOOKUP($K$4,'Цвет столешницы'!A:B,2,FALSE))","v":"EVL674/А/40*40/ANT/H.U003"},null,"4800*1236*750",null,97009]
["EVL675/А/40*40/",{"$f":"CONCATENATE(A143,VLOOKUP($I$4,'Цвет мет. опор'!A:B,2,0),\"/\",VLOOKUP($J$4,'Цвет лючка'!A:B,2,0),\".\",VLOOKUP($K$4,'Цвет столешницы'!A:B,2,FALSE))","v":"EVL675/А/40*40/ANT/H.U003"},"Рабочая станция на 6 раб.места на А образном м/к 40х40 с шириной 1-го рабочего места 700 мм","3600*1436*750",null,92347]
["EVL676/А/40*40/",{"$f":"CONCATENATE(A144,VLOOKUP($I$4,'Цвет мет. опор'!A:B,2,0),\"/\",VLOOKUP($J$4,'Цвет лючка'!A:B,2,0),\".\",VLOOKUP($K$4,'Цвет столешницы'!A:B,2,FALSE))","v":"EVL676/А/40*40/ANT/H.U003"},null,"4200*1436*750",null,97442]
["EVL677/А/40*40/",{"$f":"CONCATENATE(A145,VLOOKUP($I$4,'Цвет мет. опор'!A:B,2,0),\"/\",VLOOKUP($J$4,'Цвет лючка'!A:B,2,0),\".\",VLOOKUP($K$4,'Цвет столешницы'!A:B,2,FALSE))","v":"EVL677/А/40*40/ANT/H.U003"},null,"4800*1436*750",null,100750]
["EVL678/А/40*40/",{"$f":"CONCATENATE(A146,VLOOKUP($I$4,'Цвет мет. опор'!A:B,2,0),\"/\",VLOOKUP($J$4,'Цвет лючка'!A:B,2,0),\".\",VLOOKUP($K$4,'Цвет столешницы'!A:B,2,FALSE))","v":"EVL678/А/40*40/ANT/H.U003"},"Рабочая станция на 6 раб.места на А образном м/к 40х40 с шириной 1-го рабочего места 800 мм","3600*1636*750",null,95315]
["EVL679/А/40*40/",{"$f":"CONCATENATE(A147,VLOOKUP($I$4,'Цвет мет. опор'!A:B,2,0),\"/\",VLOOKUP($J$4,'Цвет лючка'!A:B,2,0),\".\",VLOOKUP($K$4,'Цвет столешницы'!A:B,2,FALSE))","v":"EVL679/А/40*40/ANT/H.U003"},null,"4200*1636*750",null,100602]
["EVL680/А/40*40/",{"$f":"CONCATENATE(A148,VLOOKUP($I$4,'Цвет мет. опор'!A:B,2,0),\"/\",VLOOKUP($J$4,'Цвет лючка'!A:B,2,0),\".\",VLOOKUP($K$4,'Цвет столешницы'!A:B,2,FALSE))","v":"EVL680/А/40*40/ANT/H.U003"},null,"4800*1636*750",null,105127]
[null,"Переговорные столы"]
["EVL800/А/40*40/",{"$f":"CONCATENATE(A150,VLOOKUP($I$4,'Цвет мет. опор'!A:B,2,0),\".\",VLOOKUP($K$4,'Цвет столешницы'!A:B,2,FALSE))","v":"EVL800/А/40*40/ANT.U003"},"Переговорный стол \n(1 столешница) \nна А образном м/к 40х40","1000*1236*750",null,30348]
["EVL801/А/40*40/",{"$f":"CONCATENATE(A151,VLOOKUP($I$4,'Цвет мет. опор'!A:B,2,0),\".\",VLOOKUP($K$4,'Цвет столешницы'!A:B,2,FALSE))","v":"EVL801/А/40*40/ANT.U003"},null,"1200*1236*750",null,31589]
["EVL802/А/40*40/",{"$f":"CONCATENATE(A152,VLOOKUP($I$4,'Цвет мет. опор'!A:B,2,0),\".\",VLOOKUP($K$4,'Цвет столешницы'!A:B,2,FALSE))","v":"EVL802/А/40*40/ANT.U003"},null,"1400*1236*750",null,33062]
["EVL803/А/40*40/",{"$f":"CONCATENATE(A153,VLOOKUP($I$4,'Цвет мет. опор'!A:B,2,0),\".\",VLOOKUP($K$4,'Цвет столешницы'!A:B,2,FALSE))","v":"EVL803/А/40*40/ANT.U003"},null,"1600*1236*750",null,34958]
["EVL804/А/40*40/",{"$f":"CONCATENATE(A154,VLOOKUP($I$4,'Цвет мет. опор'!A:B,2,0),\".\",VLOOKUP($K$4,'Цвет столешницы'!A:B,2,FALSE))","v":"EVL804/А/40*40/ANT.U003"},null,"1800*1236*750",null,36896]
["EVL805/А/40*40/",{"$f":"CONCATENATE(A155,VLOOKUP($I$4,'Цвет мет. опор'!A:B,2,0),\".\",VLOOKUP($K$4,'Цвет столешницы'!A:B,2,FALSE))","v":"EVL805/А/40*40/ANT.U003"},"Переговорный стол \n(2 столешницы)\n на А образном м/к 40х40","2000*1236*750",null,51362]
["EVL806/А/40*40/",{"$f":"CONCATENATE(A156,VLOOKUP($I$4,'Цвет мет. опор'!A:B,2,0),\".\",VLOOKUP($K$4,'Цвет столешницы'!A:B,2,FALSE))","v":"EVL806/А/40*40/ANT.U003"},null,"2400*1236*750",null,53455]
["EVL807/А/40*40/",{"$f":"CONCATENATE(A157,VLOOKUP($I$4,'Цвет мет. опор'!A:B,2,0),\".\",VLOOKUP($K$4,'Цвет столешницы'!A:B,2,FALSE))","v":"EVL807/А/40*40/ANT.U003"},null,"2800*1236*750",null,55948]
["EVL808/А/40*40/",{"$f":"CONCATENATE(A158,VLOOKUP($I$4,'Цвет мет. опор'!A:B,2,0),\".\",VLOOKUP($K$4,'Цвет столешницы'!A:B,2,FALSE))","v":"EVL808/А/40*40/ANT.U003"},null,"3200*1236*750",null,66111]
["EVL809/А/40*40/",{"$f":"CONCATENATE(A159,VLOOKUP($I$4,'Цвет мет. опор'!A:B,2,0),\".\",VLOOKUP($K$4,'Цвет столешницы'!A:B,2,FALSE))","v":"EVL809/А/40*40/ANT.U003"},null,"3600*1236*750",null,69900]
["EVL810/А/40*40/",{"$f":"CONCATENATE(A160,VLOOKUP($I$4,'Цвет мет. опор'!A:B,2,0),\".\",VLOOKUP($K$4,'Цвет столешницы'!A:B,2,FALSE))","v":"EVL810/А/40*40/ANT.U003"},"Переговорный стол\n (3 столешницы)\n на А образном м/к 40х40","3000*1236*750",null,71261]
["EVL811/А/40*40/",{"$f":"CONCATENATE(A161,VLOOKUP($I$4,'Цвет мет. опор'!A:B,2,0),\".\",VLOOKUP($K$4,'Цвет столешницы'!A:B,2,FALSE))","v":"EVL811/А/40*40/ANT.U003"},null,"3600*1236*750",null,78174]
["EVL812/А/40*40/",{"$f":"CONCATENATE(A162,VLOOKUP($I$4,'Цвет мет. опор'!A:B,2,0),\".\",VLOOKUP($K$4,'Цвет столешницы'!A:B,2,FALSE))","v":"EVL812/А/40*40/ANT.U003"},null,"4200*1236*750",null,81914]
["EVL813/А/40*40/",{"$f":"CONCATENATE(A163,VLOOKUP($I$4,'Цвет мет. опор'!A:B,2,0),\".\",VLOOKUP($K$4,'Цвет столешницы'!A:B,2,FALSE))","v":"EVL813/А/40*40/ANT.U003"},null,"4800*1236*750",null,84346]
["EVL814/А/40*40/",{"$f":"CONCATENATE(A164,VLOOKUP($I$4,'Цвет мет. опор'!A:B,2,0),\".\",VLOOKUP($K$4,'Цвет столешницы'!A:B,2,FALSE))","v":"EVL814/А/40*40/ANT.U003"},null,"5400*1236*750",null,87441]
["EVL841/А/40*40/",{"$f":"CONCATENATE(A165,VLOOKUP($I$4,'Цвет мет. опор'!A:B,2,0),\".\",VLOOKUP($K$4,'Цвет столешницы'!A:B,2,FALSE))","v":"EVL841/А/40*40/ANT.U003"},"Переговорный стол (3 столешницы)\n на А-образном м/к 40х40","3600*1436*750",null,80596]
["EVL842/А/40*40/",{"$f":"CONCATENATE(A166,VLOOKUP($I$4,'Цвет мет. опор'!A:B,2,0),\".\",VLOOKUP($K$4,'Цвет столешницы'!A:B,2,FALSE))","v":"EVL842/А/40*40/ANT.U003"},null,"4200*1436*750",null,84444]
["EVL843/А/40*40/",{"$f":"CONCATENATE(A167,VLOOKUP($I$4,'Цвет мет. опор'!A:B,2,0),\".\",VLOOKUP($K$4,'Цвет столешницы'!A:B,2,FALSE))","v":"EVL843/А/40*40/ANT.U003"},null,"4800*1436*750",null,86975]
["EVL844/А/40*40/",{"$f":"CONCATENATE(A168,VLOOKUP($I$4,'Цвет мет. опор'!A:B,2,0),\".\",VLOOKUP($K$4,'Цвет столешницы'!A:B,2,FALSE))","v":"EVL844/А/40*40/ANT.U003"},null,"5400*1436*750",null,89106]
[null,null,"Кодировка Артикула стола"]
[null,null,"Модель стола разворот стола /Цвет опор/Цв. заглушки. Цвет столешницы  "]
[null,"МОДЕЛЬ СТОЛА (ФОРМА, РАЗМЕР)","ПРАВОСТОРОННИЙ /ЛЕВОСТОРОННИЙ","ЦВЕТ ОПОР","ЦВЕТ ЗАГЛУШКИ, РУЧЕК","ЦВЕТ СТОЛЕШНИЦЫ"]
[null,null,"SX-левый","АNT-АНТРАЦИТ","АNT-АНТРАЦИТ","H","Белый"]
[null,null,"DX-правый","WHT-БЕЛЫЙ ","H-БЕЛЫЙ ","U727 ","Серый Камень"]
[null,null,null,"GR-СЕРЫЙ","G-СЕРЫЙ","R2","Серый"]
[null,null,null,null,null,"ANT","Антрацит"]
[null,null,null,null,null,"U003","Дуб Честерфилд"]
[null,null,null,null,null,"L","Дуб 131"]

{"sheet":"Столы на О-обр. 40х40","index":7,"n_rows":183,"n_cols":12,"rows_kept":183,"cut":false,"hidden":false,"merged":[[1,1,1,5],[2,1,3,5],[1,6,3,6],[0,7,0,8],[139,2,141,2],[139,4,141,4],[165,2,169,2],[165,4,169,4],[142,4,144,4],[155,2,159,2],[155,4,159,4],[160,2,164,2],[160,4,164,4],[145,2,147,2],[148,2,150,2],[151,2,153,2],[145,4,147,4],[148,4,150,4],[151,4,153,4],[124,2,126,2],[124,4,126,4],[130,2,132,2],[130,4,132,4],[133,2,135,2],[133,4,135,4],[136,2,138,2],[136,4,138,4],[81,2,85,2],[81,4,85,4],[86,2,90,2],[86,4,90,4],[91,2,95,2],[91,4,95,4],[121,2,123,2],[121,4,123,4],[96,2,100,2],[96,4,100,4],[101,2,105,2],[101,4,105,4],[106,2,110,2],[106,4,110,4],[118,2,120,2],[118,4,120,4],[117,1,117,4],[72,2,74,2],[72,4,74,4],[75,2,77,2],[75,4,77,4],[127,2,129,2],[127,4,129,4],[58,2,59,2],[58,4,59,4],[60,2,62,2],[60,4,62,4],[63,2,65,2],[63,4,65,4],[66,2,68,2],[66,4,68,4],[111,2,116,2],[111,4,116,4],[54,2,55,2],[54,4,55,4],[44,2,47,2],[44,4,47,4],[40,2,43,2],[40,4,43,4],[56,2,57,2],[56,4,57,4],[69,2,71,2],[69,4,71,4],[30,4,31,4],[32,2,33,2],[32,4,33,4],[34,2,35,2],[34,4,35,4],[48,2,50,2],[48,4,50,4],[51,2,53,2],[51,4,53,4],[176,5,176,6],[79,2,80,2],[79,4,80,4],[170,2,173,2],[170,4,173,4],[1,9,1,11],[142,2,144,2],[5,2,8,2],[5,4,8,4],[9,2,13,2],[9,4,13,4],[14,2,18,2],[14,4,18,4],[20,2,21,2],[20,4,21,4],[22,2,24,2],[22,4,24,4],[25,2,26,2],[25,4,26,4],[36,2,39,2],[36,4,39,4],[27,2,29,2],[27,4,29,4],[30,2,31,2]]}
[null,"EVOLUTION",null,null,null,{"$f":"Склаская!F1","v":"2025-05-23"}]
[null,"Столы, бенчи и рабочие станции на металлокаркасе: О-образные опоры - труба с сечением 40*40мм, траверсы - труба 40*20мм в цв. Антрацит, Белый.  Столешницы ЛДСП - 25 мм.",null,null,null,null,null,null,null,"Формирование артикула \nв зависимости от выбранных характеристик"]
[null,"Не складская программа производятся на заказ партией от 6 шт., со сроком по согласованию с производством, в цвете: Дуб Честерфилд, Белый, Антрацит, Серый R2, Дуб 131, Серый камень, Венге Цаво, Бетон. Опоры столов в цв. Антрацит, Белый, Серый.\nЗаглушки кабель-каналов и ручки тумб: Антрацит, Белый.\nДля заказа изделия следует пользоваться правилами кодировки для создания  артикула.  →→→→",null,null,null,null,null,null,null,"Цвет Опор","Цвет кабель-канала","Цвет столешницы"]
[null,null,null,null,null,null,null,null,null,"Антрацит","Антрацит","Дуб Честерфилд"]
["Артикул","Артикул","Наименование","Размеры Ш*Г*В (мм)","Изображение","Розничная Цена, руб."]
["EVL113/О/40*40/",{"$f":"CONCATENATE(A6,VLOOKUP($J$4,'Цвет мет. опор'!A:B,2,0),\"/\",VLOOKUP($K$4,'Цвет лючка'!A:B,2,0),\".\",VLOOKUP($L$4,'Цвет столешницы'!A:B,2,FALSE))","v":"EVL113/О/40*40/ANT/ANT.U003"},"Стол письменный на О образном  м/к 40х40, глубиной 600 мм","1000*600*750",null,18409]
["EVL114/О/40*40/",{"$f":"CONCATENATE(A7,VLOOKUP($J$4,'Цвет мет. опор'!A:B,2,0),\"/\",VLOOKUP($K$4,'Цвет лючка'!A:B,2,0),\".\",VLOOKUP($L$4,'Цвет столешницы'!A:B,2,FALSE))","v":"EVL114/О/40*40/ANT/ANT.U003"},null,"1200*600*750",null,19151]
["EVL115/О/40*40/",{"$f":"CONCATENATE(A8,VLOOKUP($J$4,'Цвет мет. опор'!A:B,2,0),\"/\",VLOOKUP($K$4,'Цвет лючка'!A:B,2,0),\".\",VLOOKUP($L$4,'Цвет столешницы'!A:B,2,FALSE))","v":"EVL115/О/40*40/ANT/ANT.U003"},null,"1400*600*750",null,19626]
["EVL116/О/40*40/",{"$f":"CONCATENATE(A9,VLOOKUP($J$4,'Цвет мет. опор'!A:B,2,0),\"/\",VLOOKUP($K$4,'Цвет лючка'!A:B,2,0),\".\",VLOOKUP($L$4,'Цвет столешницы'!A:B,2,FALSE))","v":"EVL116/О/40*40/ANT/ANT.U003"},null,"1600*600*750",null,20504]
["EVL100/О/40*40/",{"$f":"CONCATENATE(A10,VLOOKUP($J$4,'Цвет мет. опор'!A:B,2,0),\"/\",VLOOKUP($K$4,'Цвет лючка'!A:B,2,0),\".\",VLOOKUP($L$4,'Цвет столешницы'!A:B,2,FALSE))","v":"EVL100/О/40*40/ANT/ANT.U003"},"Стол письменный на О образном  м/к 40х40, глубиной 700 мм","1000*700*750",null,19238]
["EVL101/О/40*40/",{"$f":"CONCATENATE(A11,VLOOKUP($J$4,'Цвет мет. опор'!A:B,2,0),\"/\",VLOOKUP($K$4,'Цвет лючка'!A:B,2,0),\".\",VLOOKUP($L$4,'Цвет столешницы'!A:B,2,FALSE))","v":"EVL101/О/40*40/ANT/ANT.U003"},null,"1200*700*750",null,20103]
["EVL102/0/40*40",{"$f":"CONCATENATE(A12,VLOOKUP($J$4,'Цвет мет. опор'!A:B,2,0),\"/\",VLOOKUP($K$4,'Цвет лючка'!A:B,2,0),\".\",VLOOKUP($L$4,'Цвет столешницы'!A:B,2,FALSE))","v":"EVL102/0/40*40ANT/ANT.U003"},null,"1400*700*750",null,20862]
["EVL103/0/40*40",{"$f":"CONCATENATE(A13,VLOOKUP($J$4,'Цвет мет. опор'!A:B,2,0),\"/\",VLOOKUP($K$4,'Цвет лючка'!A:B,2,0),\".\",VLOOKUP($L$4,'Цвет столешницы'!A:B,2,FALSE))","v":"EVL103/0/40*40ANT/ANT.U003"},null,"1600*700*750",null,21502]
["EVL104/О/40*40/",{"$f":"CONCATENATE(A14,VLOOKUP($J$4,'Цвет мет. опор'!A:B,2,0),\"/\",VLOOKUP($K$4,'Цвет лючка'!A:B,2,0),\".\",VLOOKUP($L$4,'Цвет столешницы'!A:B,2,FALSE))","v":"EVL104/О/40*40/ANT/ANT.U003"},null,"1800*700*750",null,22271]
["EVL117/О/40*40/",{"$f":"CONCATENATE(A15,VLOOKUP($J$4,'Цвет мет. опор'!A:B,2,0),\"/\",VLOOKUP($K$4,'Цвет лючка'!A:B,2,0),\".\",VLOOKUP($L$4,'Цвет столешницы'!A:B,2,FALSE))","v":"EVL117/О/40*40/ANT/ANT.U003"},"Стол письменный на О образном  м/к 40х40, глубиной 800 мм","1000*800*750",null,19528]
["EVL118/О/40*40/",{"$f":"CONCATENATE(A16,VLOOKUP($J$4,'Цвет мет. опор'!A:B,2,0),\"/\",VLOOKUP($K$4,'Цвет лючка'!A:B,2,0),\".\",VLOOKUP($L$4,'Цвет столешницы'!A:B,2,FALSE))","v":"EVL118/О/40*40/ANT/ANT.U003"},null,"1200*800*750",null,20633]
["EVL119/О/40*40/",{"$f":"CONCATENATE(A17,VLOOKUP($J$4,'Цвет мет. опор'!A:B,2,0),\"/\",VLOOKUP($K$4,'Цвет лючка'!A:B,2,0),\".\",VLOOKUP($L$4,'Цвет столешницы'!A:B,2,FALSE))","v":"EVL119/О/40*40/ANT/ANT.U003"},null,"1400*800*750",null,21514]
["EVL120/О/40*40/",{"$f":"CONCATENATE(A18,VLOOKUP($J$4,'Цвет мет. опор'!A:B,2,0),\"/\",VLOOKUP($K$4,'Цвет лючка'!A:B,2,0),\".\",VLOOKUP($L$4,'Цвет столешницы'!A:B,2,FALSE))","v":"EVL120/О/40*40/ANT/ANT.U003"},null,"1600*800*750",null,22268]
["EVL121/О/40*40/",{"$f":"CONCATENATE(A19,VLOOKUP($J$4,'Цвет мет. опор'!A:B,2,0),\"/\",VLOOKUP($K$4,'Цвет лючка'!A:B,2,0),\".\",VLOOKUP($L$4,'Цвет столешницы'!A:B,2,FALSE))","v":"EVL121/О/40*40/ANT/ANT.U003"},null,"1800*800*750",null,23166]
["EVL122/О/40*40/",{"$f":"CONCATENATE(A20,VLOOKUP($J$4,'Цвет мет. опор'!A:B,2,0),\"/\",VLOOKUP($K$4,'Цвет лючка'!A:B,2,0),\".\",VLOOKUP($L$4,'Цвет столешницы'!A:B,2,FALSE))","v":"EVL122/О/40*40/ANT/ANT.U003"},"Стол письменный на О образном  м/к 40х40, глубиной 900 мм","1800*900*750",null,23313]
["EVL123SX(DX)/О/40*40/",{"$f":"CONCATENATE(A21,VLOOKUP($J$4,'Цвет мет. опор'!A:B,2,0),\"/\",VLOOKUP($K$4,'Цвет лючка'!A:B,2,0),\".\",VLOOKUP($L$4,'Цвет столешницы'!A:B,2,FALSE))","v":"EVL123SX(DX)/О/40*40/ANT/ANT.U003"},"Стол криволинейный левый/правый на О образном  м/к 40х40, глубиной 600/900 мм","1200*900*750","правый",20901]
["EVL124SX(DX)/О/40*40/",{"$f":"CONCATENATE(A22,VLOOKUP($J$4,'Цвет мет. опор'!A:B,2,0),\"/\",VLOOKUP($K$4,'Цвет лючка'!A:B,2,0),\".\",VLOOKUP($L$4,'Цвет столешницы'!A:B,2,FALSE))","v":"EVL124SX(DX)/О/40*40/ANT/ANT.U003"},null,"1400*900*750",null,20897]
["EVL105SX(DX)/О/40*40/",{"$f":"CONCATENATE(A23,VLOOKUP($J$4,'Цвет мет. опор'!A:B,2,0),\"/\",VLOOKUP($K$4,'Цвет лючка'!A:B,2,0),\".\",VLOOKUP($L$4,'Цвет столешницы'!A:B,2,FALSE))","v":"EVL105SX(DX)/О/40*40/ANT/ANT.U003"},"Стол криволинейный левый/правый на О образном  м/к 40х40, глубиной 700/900 мм","1200*900*750","правый",20129]
["EVL106SX(DX)/О/40*40/",{"$f":"CONCATENATE(A24,VLOOKUP($J$4,'Цвет мет. опор'!A:B,2,0),\"/\",VLOOKUP($K$4,'Цвет лючка'!A:B,2,0),\".\",VLOOKUP($L$4,'Цвет столешницы'!A:B,2,FALSE))","v":"EVL106SX(DX)/О/40*40/ANT/ANT.U003"},null,"1400*900*750",null,21205]
["EVL107SX(DX)/О/40*40/",{"$f":"CONCATENATE(A25,VLOOKUP($J$4,'Цвет мет. опор'!A:B,2,0),\"/\",VLOOKUP($K$4,'Цвет лючка'!A:B,2,0),\".\",VLOOKUP($L$4,'Цвет столешницы'!A:B,2,FALSE))","v":"EVL107SX(DX)/О/40*40/ANT/ANT.U003"},null,"1600*900*750",null,21902]
["EVL125SX(DX)/О/40*40/",{"$f":"CONCATENATE(A26,VLOOKUP($J$4,'Цвет мет. опор'!A:B,2,0),\"/\",VLOOKUP($K$4,'Цвет лючка'!A:B,2,0),\".\",VLOOKUP($L$4,'Цвет столешницы'!A:B,2,FALSE))","v":"EVL125SX(DX)/О/40*40/ANT/ANT.U003"},"Стол криволинейный левый/правый на О образном  м/к 40х40, глубиной 800/900 мм","1400*900*750",null,22028]
["EVL126SX(DX)/О/40*40/",{"$f":"CONCATENATE(A27,VLOOKUP($J$4,'Цвет мет. опор'!A:B,2,0),\"/\",VLOOKUP($K$4,'Цвет лючка'!A:B,2,0),\".\",VLOOKUP($L$4,'Цвет столешницы'!A:B,2,FALSE))","v":"EVL126SX(DX)/О/40*40/ANT/ANT.U003"},null,"1600*900*750",null,22724]
["EVL109SX(DX)/О/40*40",{"$f":"CONCATENATE(A28,VLOOKUP($J$4,'Цвет мет. опор'!A:B,2,0),\"/\",VLOOKUP($K$4,'Цвет лючка'!A:B,2,0),\".\",VLOOKUP($L$4,'Цвет столешницы'!A:B,2,FALSE))","v":"EVL109SX(DX)/О/40*40ANT/ANT.U003"},"Стол эргономичный левый/правый на О образном  м/к 40х40, глубиной 700/900 мм","1200х900/700х750",null,20106]
["EVL110SX(DX)/О/40*40",{"$f":"CONCATENATE(A29,VLOOKUP($J$4,'Цвет мет. опор'!A:B,2,0),\"/\",VLOOKUP($K$4,'Цвет лючка'!A:B,2,0),\".\",VLOOKUP($L$4,'Цвет столешницы'!A:B,2,FALSE))","v":"EVL110SX(DX)/О/40*40ANT/ANT.U003"},null,"1400х900/700х750",null,20999]
["EVL111SX(DX)/О/40*40",{"$f":"CONCATENATE(A30,VLOOKUP($J$4,'Цвет мет. опор'!A:B,2,0),\"/\",VLOOKUP($K$4,'Цвет лючка'!A:B,2,0),\".\",VLOOKUP($L$4,'Цвет столешницы'!A:B,2,FALSE))","v":"EVL111SX(DX)/О/40*40ANT/ANT.U003"},null,"1600х900/700х750",null,21877]
["EVL127SX(DX)/О/40*40/",{"$f":"CONCATENATE(A31,VLOOKUP($J$4,'Цвет мет. опор'!A:B,2,0),\"/\",VLOOKUP($K$4,'Цвет лючка'!A:B,2,0),\".\",VLOOKUP($L$4,'Цвет столешницы'!A:B,2,FALSE))","v":"EVL127SX(DX)/О/40*40/ANT/ANT.U003"},"Стол эргономичный левый/правый на О образном  м/к 40х40, глубиной 600/1200 мм","1400*1200*750",null,31717]
["EVL128SX(DX)/О/40*40/",{"$f":"CONCATENATE(A32,VLOOKUP($J$4,'Цвет мет. опор'!A:B,2,0),\"/\",VLOOKUP($K$4,'Цвет лючка'!A:B,2,0),\".\",VLOOKUP($L$4,'Цвет столешницы'!A:B,2,FALSE))","v":"EVL128SX(DX)/О/40*40/ANT/ANT.U003"},null,"1600*1200*750",null,32616]
["EVL129SX(DX)/О/40*40/",{"$f":"CONCATENATE(A33,VLOOKUP($J$4,'Цвет мет. опор'!A:B,2,0),\"/\",VLOOKUP($K$4,'Цвет лючка'!A:B,2,0),\".\",VLOOKUP($L$4,'Цвет столешницы'!A:B,2,FALSE))","v":"EVL129SX(DX)/О/40*40/ANT/ANT.U003"},"Стол эргономичный левый/правый на О образном  м/к 40х40, глубиной 700/1200 мм","1400*1200*750",null,32245]
["EVL130SX(DX)/О/40*40/",{"$f":"CONCATENATE(A34,VLOOKUP($J$4,'Цвет мет. опор'!A:B,2,0),\"/\",VLOOKUP($K$4,'Цвет лючка'!A:B,2,0),\".\",VLOOKUP($L$4,'Цвет столешницы'!A:B,2,FALSE))","v":"EVL130SX(DX)/О/40*40/ANT/ANT.U003"},null,"1600*1200*750",null,33137]
["EVL131SX(DX)/О/40*40/",{"$f":"CONCATENATE(A35,VLOOKUP($J$4,'Цвет мет. опор'!A:B,2,0),\"/\",VLOOKUP($K$4,'Цвет лючка'!A:B,2,0),\".\",VLOOKUP($L$4,'Цвет столешницы'!A:B,2,FALSE))","v":"EVL131SX(DX)/О/40*40/ANT/ANT.U003"},"Стол эргономичный левый/правый на О образном  м/к 40х40, глубиной 800/1200 мм","1400*1200*750",null,32611]
["EVL132SX(DX)/О/40*40/",{"$f":"CONCATENATE(A36,VLOOKUP($J$4,'Цвет мет. опор'!A:B,2,0),\"/\",VLOOKUP($K$4,'Цвет лючка'!A:B,2,0),\".\",VLOOKUP($L$4,'Цвет столешницы'!A:B,2,FALSE))","v":"EVL132SX(DX)/О/40*40/ANT/ANT.U003"},null,"1600*1200*750",null,33427]
["EVL601/О/40*40/",{"$f":"CONCATENATE(A37,VLOOKUP($J$4,'Цвет мет. опор'!A:B,2,0),\"/\",VLOOKUP($K$4,'Цвет лючка'!A:B,2,0),\".\",VLOOKUP($L$4,'Цвет столешницы'!A:B,2,FALSE))","v":"EVL601/О/40*40/ANT/ANT.U003"},"Рабочая станция на О образном  м/к 40х40, глубиной 1236 мм","1200*1236*750",null,33454]
["EVL602/О/40*40/",{"$f":"CONCATENATE(A38,VLOOKUP($J$4,'Цвет мет. опор'!A:B,2,0),\"/\",VLOOKUP($K$4,'Цвет лючка'!A:B,2,0),\".\",VLOOKUP($L$4,'Цвет столешницы'!A:B,2,FALSE))","v":"EVL602/О/40*40/ANT/ANT.U003"},null,"1400*1236*750",null,34403]
["EVL603/О/40*40/",{"$f":"CONCATENATE(A39,VLOOKUP($J$4,'Цвет мет. опор'!A:B,2,0),\"/\",VLOOKUP($K$4,'Цвет лючка'!A:B,2,0),\".\",VLOOKUP($L$4,'Цвет столешницы'!A:B,2,FALSE))","v":"EVL603/О/40*40/ANT/ANT.U003"},null,"1600*1236*750",null,36159]
["EVL681/О/40*40/",{"$f":"CONCATENATE(A40,VLOOKUP($J$4,'Цвет мет. опор'!A:B,2,0),\"/\",VLOOKUP($K$4,'Цвет лючка'!A:B,2,0),\".\",VLOOKUP($L$4,'Цвет столешницы'!A:B,2,FALSE))","v":"EVL681/О/40*40/ANT/ANT.U003"},null,"1800*1236*751",null,37858]
["EVL604/О/40*40/",{"$f":"CONCATENATE(A41,VLOOKUP($J$4,'Цвет мет. опор'!A:B,2,0),\"/\",VLOOKUP($K$4,'Цвет лючка'!A:B,2,0),\".\",VLOOKUP($L$4,'Цвет столешницы'!A:B,2,FALSE))","v":"EVL604/О/40*40/ANT/ANT.U003"},"Рабочая станция на О образном  м/к 40х40 глубиной 1436","1200*1436*750",null,34696]
["EVL605/О/40*40/",{"$f":"CONCATENATE(A42,VLOOKUP($J$4,'Цвет мет. опор'!A:B,2,0),\"/\",VLOOKUP($K$4,'Цвет лючка'!A:B,2,0),\".\",VLOOKUP($L$4,'Цвет столешницы'!A:B,2,FALSE))","v":"EVL605/О/40*40/ANT/ANT.U003"},null,"1400*1436*750",null,37046]
["EVL606/О/40*40/",{"$f":"CONCATENATE(A43,VLOOKUP($J$4,'Цвет мет. опор'!A:B,2,0),\"/\",VLOOKUP($K$4,'Цвет лючка'!A:B,2,0),\".\",VLOOKUP($L$4,'Цвет столешницы'!A:B,2,FALSE))","v":"EVL606/О/40*40/ANT/ANT.U003"},null,"1600*1436*750",null,38327]
["EVL682/О/40*40/",{"$f":"CONCATENATE(A44,VLOOKUP($J$4,'Цвет мет. опор'!A:B,2,0),\"/\",VLOOKUP($K$4,'Цвет лючка'!A:B,2,0),\".\",VLOOKUP($L$4,'Цвет столешницы'!A:B,2,FALSE))","v":"EVL682/О/40*40/ANT/ANT.U003"},null,"1800*1436*751",null,39865]
["EVL607/О/40*40/",{"$f":"CONCATENATE(A45,VLOOKUP($J$4,'Цвет мет. опор'!A:B,2,0),\"/\",VLOOKUP($K$4,'Цвет лючка'!A:B,2,0),\".\",VLOOKUP($L$4,'Цвет столешницы'!A:B,2,FALSE))","v":"EVL607/О/40*40/ANT/ANT.U003"},"Рабочая станция на О образном  м/к 40х40 глубиной 1636","1200*1636*750",null,36500]
["EVL608/О/40*40/",{"$f":"CONCATENATE(A46,VLOOKUP($J$4,'Цвет мет. опор'!A:B,2,0),\"/\",VLOOKUP($K$4,'Цвет лючка'!A:B,2,0),\".\",VLOOKUP($L$4,'Цвет столешницы'!A:B,2,FALSE))","v":"EVL608/О/40*40/ANT/ANT.U003"},null,"1400*1636*750",null,38263]
["EVL609/О/40*40/",{"$f":"CONCATENATE(A47,VLOOKUP($J$4,'Цвет мет. опор'!A:B,2,0),\"/\",VLOOKUP($K$4,'Цвет лючка'!A:B,2,0),\".\",VLOOKUP($L$4,'Цвет столешницы'!A:B,2,FALSE))","v":"EVL609/О/40*40/ANT/ANT.U003"},null,"1600*1636*750",null,39771]
["EVL683/О/40*40/",{"$f":"CONCATENATE(A48,VLOOKUP($J$4,'Цвет мет. опор'!A:B,2,0),\"/\",VLOOKUP($K$4,'Цвет лючка'!A:B,2,0),\".\",VLOOKUP($L$4,'Цвет столешницы'!A:B,2,FALSE))","v":"EVL683/О/40*40/ANT/ANT.U003"},null,"1800*1636*750",null,41566]
["EVL610/О/40*40/",{"$f":"CONCATENATE(A49,VLOOKUP($J$4,'Цвет мет. опор'!A:B,2,0),\"/\",VLOOKUP($K$4,'Цвет лючка'!A:B,2,0),\".\",VLOOKUP($L$4,'Цвет столешницы'!A:B,2,FALSE))","v":"EVL610/О/40*40/ANT/ANT.U003"},"Рабочая станция криволинейная на О образном  м/к 40х40 глубиной 1236/1836","1200*1836*750",null,35955]
["EVL611/О/40*40/",{"$f":"CONCATENATE(A50,VLOOKUP($J$4,'Цвет мет. опор'!A:B,2,0),\"/\",VLOOKUP($K$4,'Цвет лючка'!A:B,2,0),\".\",VLOOKUP($L$4,'Цвет столешницы'!A:B,2,FALSE))","v":"EVL611/О/40*40/ANT/ANT.U003"},null,"1400*1836*750",null,37839]
["EVL612/О/40*40/",{"$f":"CONCATENATE(A51,VLOOKUP($J$4,'Цвет мет. опор'!A:B,2,0),\"/\",VLOOKUP($K$4,'Цвет лючка'!A:B,2,0),\".\",VLOOKUP($L$4,'Цвет столешницы'!A:B,2,FALSE))","v":"EVL612/О/40*40/ANT/ANT.U003"},null,"1600*1836*750",null,39258]
["EVL613/О/40*40/",{"$f":"CONCATENATE(A52,VLOOKUP($J$4,'Цвет мет. опор'!A:B,2,0),\"/\",VLOOKUP($K$4,'Цвет лючка'!A:B,2,0),\".\",VLOOKUP($L$4,'Цвет столешницы'!A:B,2,FALSE))","v":"EVL613/О/40*40/ANT/ANT.U003"},"Рабочая станция криволинейная\nна О образном  м/к 40х40 глубиной 1436/1836","1200*1836*750",null,35581]
["EVL614/О/40*40/",{"$f":"CONCATENATE(A53,VLOOKUP($J$4,'Цвет мет. опор'!A:B,2,0),\"/\",VLOOKUP($K$4,'Цвет лючка'!A:B,2,0),\".\",VLOOKUP($L$4,'Цвет столешницы'!A:B,2,FALSE))","v":"EVL614/О/40*40/ANT/ANT.U003"},null,"1400*1836*750",null,37733]
["EVL615/О/40*40/",{"$f":"CONCATENATE(A54,VLOOKUP($J$4,'Цвет мет. опор'!A:B,2,0),\"/\",VLOOKUP($K$4,'Цвет лючка'!A:B,2,0),\".\",VLOOKUP($L$4,'Цвет столешницы'!A:B,2,FALSE))","v":"EVL615/О/40*40/ANT/ANT.U003"},null,"1600*1836*750",null,39127]
["EVL616/О/40*40/",{"$f":"CONCATENATE(A55,VLOOKUP($J$4,'Цвет мет. опор'!A:B,2,0),\"/\",VLOOKUP($K$4,'Цвет лючка'!A:B,2,0),\".\",VLOOKUP($L$4,'Цвет столешницы'!A:B,2,FALSE))","v":"EVL616/О/40*40/ANT/ANT.U003"},"Рабочая станция эргономичная \nна О образном  м/к 40х40 глубиной 1236/2436","1400*2436*750",null,58463]
["EVL617/О/40*40/",{"$f":"CONCATENATE(A56,VLOOKUP($J$4,'Цвет мет. опор'!A:B,2,0),\"/\",VLOOKUP($K$4,'Цвет лючка'!A:B,2,0),\".\",VLOOKUP($L$4,'Цвет столешницы'!A:B,2,FALSE))","v":"EVL617/О/40*40/ANT/ANT.U003"},null,"1600*2436*750",null,60326]
["EVL618/О/40*40/",{"$f":"CONCATENATE(A57,VLOOKUP($J$4,'Цвет мет. опор'!A:B,2,0),\"/\",VLOOKUP($K$4,'Цвет лючка'!A:B,2,0),\".\",VLOOKUP($L$4,'Цвет столешницы'!A:B,2,FALSE))","v":"EVL618/О/40*40/ANT/ANT.U003"},"Рабочая станция эргономичная  \nна О образном  м/к 40х40 глубиной 1436/2436","1400*2440*750",null,60109]
["EVL619/О/40*40/",{"$f":"CONCATENATE(A58,VLOOKUP($J$4,'Цвет мет. опор'!A:B,2,0),\"/\",VLOOKUP($K$4,'Цвет лючка'!A:B,2,0),\".\",VLOOKUP($L$4,'Цвет столешницы'!A:B,2,FALSE))","v":"EVL619/О/40*40/ANT/ANT.U003"},null,"1600*2440*750",null,62025]
["EVL620/О/40*40/",{"$f":"CONCATENATE(A59,VLOOKUP($J$4,'Цвет мет. опор'!A:B,2,0),\"/\",VLOOKUP($K$4,'Цвет лючка'!A:B,2,0),\".\",VLOOKUP($L$4,'Цвет столешницы'!A:B,2,FALSE))","v":"EVL620/О/40*40/ANT/ANT.U003"},"Рабочая станция эргономичная \nна О образном  м/к 40х40 глубиной 1636/2436","1400*2440*750",null,60333]
["EVL621/О/40*40/",{"$f":"CONCATENATE(A60,VLOOKUP($J$4,'Цвет мет. опор'!A:B,2,0),\"/\",VLOOKUP($K$4,'Цвет лючка'!A:B,2,0),\".\",VLOOKUP($L$4,'Цвет столешницы'!A:B,2,FALSE))","v":"EVL621/О/40*40/ANT/ANT.U003"},null,"1600*2440*750",null,62031]
["EVL622/О/40*40/",{"$f":"CONCATENATE(A61,VLOOKUP($J$4,'Цвет мет. опор'!A:B,2,0),\"/\",VLOOKUP($K$4,'Цвет лючка'!A:B,2,0),\".\",VLOOKUP($L$4,'Цвет столешницы'!A:B,2,FALSE))","v":"EVL622/О/40*40/ANT/ANT.U003"},"Рабочая станция эргономичная \nна О образном  м/к 40х40 \nглубиной 600/900","2400*900*750",null,36945]
["EVL623/О/40*40/",{"$f":"CONCATENATE(A62,VLOOKUP($J$4,'Цвет мет. опор'!A:B,2,0),\"/\",VLOOKUP($K$4,'Цвет лючка'!A:B,2,0),\".\",VLOOKUP($L$4,'Цвет столешницы'!A:B,2,FALSE))","v":"EVL623/О/40*40/ANT/ANT.U003"},null,"2800*900*750",null,38829]
["EVL624/О/40*40/",{"$f":"CONCATENATE(A63,VLOOKUP($J$4,'Цвет мет. опор'!A:B,2,0),\"/\",VLOOKUP($K$4,'Цвет лючка'!A:B,2,0),\".\",VLOOKUP($L$4,'Цвет столешницы'!A:B,2,FALSE))","v":"EVL624/О/40*40/ANT/ANT.U003"},null,"3200*900*750",null,40248]
["EVL625/О/40*40/",{"$f":"CONCATENATE(A64,VLOOKUP($J$4,'Цвет мет. опор'!A:B,2,0),\"/\",VLOOKUP($K$4,'Цвет лючка'!A:B,2,0),\".\",VLOOKUP($L$4,'Цвет столешницы'!A:B,2,FALSE))","v":"EVL625/О/40*40/ANT/ANT.U003"},"Рабочая станция эргономичная \nна О образном  м/к 40х40 \nглубиной 700/900","2400*900*750",null,37442]
["EVL626/О/40*40/",{"$f":"CONCATENATE(A65,VLOOKUP($J$4,'Цвет мет. опор'!A:B,2,0),\"/\",VLOOKUP($K$4,'Цвет лючка'!A:B,2,0),\".\",VLOOKUP($L$4,'Цвет столешницы'!A:B,2,FALSE))","v":"EVL626/О/40*40/ANT/ANT.U003"},null,"2800*900*750",null,39302]
["EVL627/О/40*40/",{"$f":"CONCATENATE(A66,VLOOKUP($J$4,'Цвет мет. опор'!A:B,2,0),\"/\",VLOOKUP($K$4,'Цвет лючка'!A:B,2,0),\".\",VLOOKUP($L$4,'Цвет столешницы'!A:B,2,FALSE))","v":"EVL627/О/40*40/ANT/ANT.U003"},null,"3200*900*750",null,40708]
["EVL628/О/40*40/",{"$f":"CONCATENATE(A67,VLOOKUP($J$4,'Цвет мет. опор'!A:B,2,0),\"/\",VLOOKUP($K$4,'Цвет лючка'!A:B,2,0),\".\",VLOOKUP($L$4,'Цвет столешницы'!A:B,2,FALSE))","v":"EVL628/О/40*40/ANT/ANT.U003"},"Рабочая станция эргономичная\nна О образном  м/к 40х40 \nглубиной 800/900","2400*900*750",null,37939]
["EVL629/О/40*40/",{"$f":"CONCATENATE(A68,VLOOKUP($J$4,'Цвет мет. опор'!A:B,2,0),\"/\",VLOOKUP($K$4,'Цвет лючка'!A:B,2,0),\".\",VLOOKUP($L$4,'Цвет столешницы'!A:B,2,FALSE))","v":"EVL629/О/40*40/ANT/ANT.U003"},null,"2800*900*750",null,39776]
["EVL630/О/40*40/",{"$f":"CONCATENATE(A69,VLOOKUP($J$4,'Цвет мет. опор'!A:B,2,0),\"/\",VLOOKUP($K$4,'Цвет лючка'!A:B,2,0),\".\",VLOOKUP($L$4,'Цвет столешницы'!A:B,2,FALSE))","v":"EVL630/О/40*40/ANT/ANT.U003"},null,"3200*900*750",null,41168]
["EVL631/О/40*40/",{"$f":"CONCATENATE(A70,VLOOKUP($J$4,'Цвет мет. опор'!A:B,2,0),\"/\",VLOOKUP($K$4,'Цвет лючка'!A:B,2,0),\".\",VLOOKUP($L$4,'Цвет столешницы'!A:B,2,FALSE))","v":"EVL631/О/40*40/ANT/ANT.U003"},"Рабочая станция эргономичная \nна О образном  м/к 40х40 \nглубиной 600/1200","2400*1236*750","промежуточная опора 1236",41235]
["EVL632/О/40*40/",{"$f":"CONCATENATE(A71,VLOOKUP($J$4,'Цвет мет. опор'!A:B,2,0),\"/\",VLOOKUP($K$4,'Цвет лючка'!A:B,2,0),\".\",VLOOKUP($L$4,'Цвет столешницы'!A:B,2,FALSE))","v":"EVL632/О/40*40/ANT/ANT.U003"},null,"2800*1236*750",null,43217]
["EVL633/О/40*40/",{"$f":"CONCATENATE(A72,VLOOKUP($J$4,'Цвет мет. опор'!A:B,2,0),\"/\",VLOOKUP($K$4,'Цвет лючка'!A:B,2,0),\".\",VLOOKUP($L$4,'Цвет столешницы'!A:B,2,FALSE))","v":"EVL633/О/40*40/ANT/ANT.U003"},null,"3200*1236*750",null,45014]
["EVL634/О/40*40/",{"$f":"CONCATENATE(A73,VLOOKUP($J$4,'Цвет мет. опор'!A:B,2,0),\"/\",VLOOKUP($K$4,'Цвет лючка'!A:B,2,0),\".\",VLOOKUP($L$4,'Цвет столешницы'!A:B,2,FALSE))","v":"EVL634/О/40*40/ANT/ANT.U003"},"Рабочая станция эргономичная \nна О образном  м/к 40х40 \nглубиной 700/1200","2400*1200*750","промежуточная опора 700",40897]
["EVL635/О/40*40/",{"$f":"CONCATENATE(A74,VLOOKUP($J$4,'Цвет мет. опор'!A:B,2,0),\"/\",VLOOKUP($K$4,'Цвет лючка'!A:B,2,0),\".\",VLOOKUP($L$4,'Цвет столешницы'!A:B,2,FALSE))","v":"EVL635/О/40*40/ANT/ANT.U003"},null,"2800*1200*750",null,43100]
["EVL636/О/40*40/",{"$f":"CONCATENATE(A75,VLOOKUP($J$4,'Цвет мет. опор'!A:B,2,0),\"/\",VLOOKUP($K$4,'Цвет лючка'!A:B,2,0),\".\",VLOOKUP($L$4,'Цвет столешницы'!A:B,2,FALSE))","v":"EVL636/О/40*40/ANT/ANT.U003"},null,"3200*1200*750",null,44815]
["EVL637/О/40*40/",{"$f":"CONCATENATE(A76,VLOOKUP($J$4,'Цвет мет. опор'!A:B,2,0),\"/\",VLOOKUP($K$4,'Цвет лючка'!A:B,2,0),\".\",VLOOKUP($L$4,'Цвет столешницы'!A:B,2,FALSE))","v":"EVL637/О/40*40/ANT/ANT.U003"},"Рабочая станция эргономичная  \nна О образном  м/к 40х40 \nглубиной 800/1200","2400*1200*750","промежуточная опора 800",40560]
["EVL638/О/40*40/",{"$f":"CONCATENATE(A77,VLOOKUP($J$4,'Цвет мет. опор'!A:B,2,0),\"/\",VLOOKUP($K$4,'Цвет лючка'!A:B,2,0),\".\",VLOOKUP($L$4,'Цвет столешницы'!A:B,2,FALSE))","v":"EVL638/О/40*40/ANT/ANT.U003"},null,"2800*1200*750",null,42983]
["EVL639/О/40*40/",{"$f":"CONCATENATE(A78,VLOOKUP($J$4,'Цвет мет. опор'!A:B,2,0),\"/\",VLOOKUP($K$4,'Цвет лючка'!A:B,2,0),\".\",VLOOKUP($L$4,'Цвет столешницы'!A:B,2,FALSE))","v":"EVL639/О/40*40/ANT/ANT.U003"},null,"3200*1200*750",null,44615]
["EVL180/О/40*40/",{"$f":"CONCATENATE(A79,VLOOKUP($J$4,'Цвет мет. опор'!A:B,2,0),\"/\",VLOOKUP($K$4,'Цвет лючка'!A:B,2,0),\".\",VLOOKUP($L$4,'Цвет столешницы'!A:B,2,FALSE))","v":"EVL180/О/40*40/ANT/ANT.U003"},"Приставка к столу рабочая 1000х500","1000x500x750",null,12095]
["EVL135/О/40*40/",{"$f":"CONCATENATE(A80,VLOOKUP($J$4,'Цвет мет. опор'!A:B,2,0),\"/\",VLOOKUP($K$4,'Цвет лючка'!A:B,2,0),\".\",VLOOKUP($L$4,'Цвет столешницы'!A:B,2,FALSE))","v":"EVL135/О/40*40/ANT/ANT.U003"},"Приставной элемент на О образном  м/к 40х40 глуб. 700 (используется в качестве брифинга)","1000*600*750",null,14089]
["EVL137/О/40*40/",{"$f":"CONCATENATE(A81,VLOOKUP($J$4,'Цвет мет. опор'!A:B,2,0),\"/\",VLOOKUP($K$4,'Цвет лючка'!A:B,2,0),\".\",VLOOKUP($L$4,'Цвет столешницы'!A:B,2,FALSE))","v":"EVL137/О/40*40/ANT/ANT.U003"},null,"1200*700*750",null,15629]
["EVL701/О/40*40/",{"$f":"CONCATENATE(A82,VLOOKUP($J$4,'Цвет мет. опор'!A:B,2,0),\"/\",VLOOKUP($K$4,'Цвет лючка'!A:B,2,0),\".\",VLOOKUP($L$4,'Цвет столешницы'!A:B,2,FALSE))","v":"EVL701/О/40*40/ANT/ANT.U003"},"Рабочая станция на О образном  м/к 40х40 с тумбой \n(композиция стол+тумба)","1450*700*750","Тумба 450х700х750",34457]
["EVL702/О/40*40/",{"$f":"CONCATENATE(A83,VLOOKUP($J$4,'Цвет мет. опор'!A:B,2,0),\"/\",VLOOKUP($K$4,'Цвет лючка'!A:B,2,0),\".\",VLOOKUP($L$4,'Цвет столешницы'!A:B,2,FALSE))","v":"EVL702/О/40*40/ANT/ANT.U003"},null,"1650*700*750",null,35321]
["EVL703/О/40*40/",{"$f":"CONCATENATE(A84,VLOOKUP($J$4,'Цвет мет. опор'!A:B,2,0),\"/\",VLOOKUP($K$4,'Цвет лючка'!A:B,2,0),\".\",VLOOKUP($L$4,'Цвет столешницы'!A:B,2,FALSE))","v":"EVL703/О/40*40/ANT/ANT.U003"},null,"1850*700*750",null,36080]
["EVL704/О/40*40/",{"$f":"CONCATENATE(A85,VLOOKUP($J$4,'Цвет мет. опор'!A:B,2,0),\"/\",VLOOKUP($K$4,'Цвет лючка'!A:B,2,0),\".\",VLOOKUP($L$4,'Цвет столешницы'!A:B,2,FALSE))","v":"EVL704/О/40*40/ANT/ANT.U003"},null,"2050*700*750",null,36721]
["EVL705/О/40*40/",{"$f":"CONCATENATE(A86,VLOOKUP($J$4,'Цвет мет. опор'!A:B,2,0),\"/\",VLOOKUP($K$4,'Цвет лючка'!A:B,2,0),\".\",VLOOKUP($L$4,'Цвет столешницы'!A:B,2,FALSE))","v":"EVL705/О/40*40/ANT/ANT.U003"},null,"2250*700*750",null,34747]
["EVL706/О/40*40/",{"$f":"CONCATENATE(A87,VLOOKUP($J$4,'Цвет мет. опор'!A:B,2,0),\"/\",VLOOKUP($K$4,'Цвет лючка'!A:B,2,0),\".\",VLOOKUP($L$4,'Цвет столешницы'!A:B,2,FALSE))","v":"EVL706/О/40*40/ANT/ANT.U003"},"Рабочая станция на О образном  м/к 40х40 с тумбой \n(композиция двойной бенч+тумба)","1450*1436*750","Тумба  450х1436х750",60360]
["EVL707/О/40*40/",{"$f":"CONCATENATE(A88,VLOOKUP($J$4,'Цвет мет. опор'!A:B,2,0),\"/\",VLOOKUP($K$4,'Цвет лючка'!A:B,2,0),\".\",VLOOKUP($L$4,'Цвет столешницы'!A:B,2,FALSE))","v":"EVL707/О/40*40/ANT/ANT.U003"},null,"1650*1436*750",null,62089]
["EVL708/О/40*40/",{"$f":"CONCATENATE(A89,VLOOKUP($J$4,'Цвет мет. опор'!A:B,2,0),\"/\",VLOOKUP($K$4,'Цвет лючка'!A:B,2,0),\".\",VLOOKUP($L$4,'Цвет столешницы'!A:B,2,FALSE))","v":"EVL708/О/40*40/ANT/ANT.U003"},null,"1850*1436*750",null,63607]
["EVL709/О/40*40/",{"$f":"CONCATENATE(A90,VLOOKUP($J$4,'Цвет мет. опор'!A:B,2,0),\"/\",VLOOKUP($K$4,'Цвет лючка'!A:B,2,0),\".\",VLOOKUP($L$4,'Цвет столешницы'!A:B,2,FALSE))","v":"EVL709/О/40*40/ANT/ANT.U003"},null,"2050*1436*750",null,64888]
["EVL710/О/40*40/",{"$f":"CONCATENATE(A91,VLOOKUP($J$4,'Цвет мет. опор'!A:B,2,0),\"/\",VLOOKUP($K$4,'Цвет лючка'!A:B,2,0),\".\",VLOOKUP($L$4,'Цвет столешницы'!A:B,2,FALSE))","v":"EVL710/О/40*40/ANT/ANT.U003"},null,"2250*1436*750",null,66425]
["EVL711/О/40*40/",{"$f":"CONCATENATE(A92,VLOOKUP($J$4,'Цвет мет. опор'!A:B,2,0),\"/\",VLOOKUP($K$4,'Цвет лючка'!A:B,2,0),\".\",VLOOKUP($L$4,'Цвет столешницы'!A:B,2,FALSE))","v":"EVL711/О/40*40/ANT/ANT.U003"},"Рабочая станция на О образном  м/к 40х40 со шкафом-купе\n(композиция двойной бенч+шкаф-купе)","1410*1436*750","Шкаф купе приставной 1440х410х750",54264]
["EVL712/О/40*40/",{"$f":"CONCATENATE(A93,VLOOKUP($J$4,'Цвет мет. опор'!A:B,2,0),\"/\",VLOOKUP($K$4,'Цвет лючка'!A:B,2,0),\".\",VLOOKUP($L$4,'Цвет столешницы'!A:B,2,FALSE))","v":"EVL712/О/40*40/ANT/ANT.U003"},null,"1610*1436*750",null,55161]
["EVL713/О/40*40/",{"$f":"CONCATENATE(A94,VLOOKUP($J$4,'Цвет мет. опор'!A:B,2,0),\"/\",VLOOKUP($K$4,'Цвет лючка'!A:B,2,0),\".\",VLOOKUP($L$4,'Цвет столешницы'!A:B,2,FALSE))","v":"EVL713/О/40*40/ANT/ANT.U003"},null,"1810*1436*750",null,57511]
["EVL714/О/40*40/",{"$f":"CONCATENATE(A95,VLOOKUP($J$4,'Цвет мет. опор'!A:B,2,0),\"/\",VLOOKUP($K$4,'Цвет лючка'!A:B,2,0),\".\",VLOOKUP($L$4,'Цвет столешницы'!A:B,2,FALSE))","v":"EVL714/О/40*40/ANT/ANT.U003"},null,"2010*1436*750",null,58792]
["EVL715/О/40*40/",{"$f":"CONCATENATE(A96,VLOOKUP($J$4,'Цвет мет. опор'!A:B,2,0),\"/\",VLOOKUP($K$4,'Цвет лючка'!A:B,2,0),\".\",VLOOKUP($L$4,'Цвет столешницы'!A:B,2,FALSE))","v":"EVL715/О/40*40/ANT/ANT.U003"},null,"2210*1436*750",null,60329]
["EVL716/О/40*40/",{"$f":"CONCATENATE(A97,VLOOKUP($J$4,'Цвет мет. опор'!A:B,2,0),\"/\",VLOOKUP($K$4,'Цвет лючка'!A:B,2,0),\".\",VLOOKUP($L$4,'Цвет столешницы'!A:B,2,FALSE))","v":"EVL716/О/40*40/ANT/ANT.U003"},"Рабочая станция на О образном  м/к 40х40 со шкафом-купе\n(композиция двойной бенч+шкаф-купе)","1410*1436*1098","Шкаф купе приставной 1440х410х1098",59126]
["EVL717/О/40*40/",{"$f":"CONCATENATE(A98,VLOOKUP($J$4,'Цвет мет. опор'!A:B,2,0),\"/\",VLOOKUP($K$4,'Цвет лючка'!A:B,2,0),\".\",VLOOKUP($L$4,'Цвет столешницы'!A:B,2,FALSE))","v":"EVL717/О/40*40/ANT/ANT.U003"},null,"1610*1436*1098",null,60023]
["EVL718/О/40*40/",{"$f":"CONCATENATE(A99,VLOOKUP($J$4,'Цвет мет. опор'!A:B,2,0),\"/\",VLOOKUP($K$4,'Цвет лючка'!A:B,2,0),\".\",VLOOKUP($L$4,'Цвет столешницы'!A:B,2,FALSE))","v":"EVL718/О/40*40/ANT/ANT.U003"},null,"1810*1436*1098",null,62373]
["EVL719/О/40*40/",{"$f":"CONCATENATE(A100,VLOOKUP($J$4,'Цвет мет. опор'!A:B,2,0),\"/\",VLOOKUP($K$4,'Цвет лючка'!A:B,2,0),\".\",VLOOKUP($L$4,'Цвет столешницы'!A:B,2,FALSE))","v":"EVL719/О/40*40/ANT/ANT.U003"},null,"2010*1436*1098",null,63654]
["EVL720/О/40*40/",{"$f":"CONCATENATE(A101,VLOOKUP($J$4,'Цвет мет. опор'!A:B,2,0),\"/\",VLOOKUP($K$4,'Цвет лючка'!A:B,2,0),\".\",VLOOKUP($L$4,'Цвет столешницы'!A:B,2,FALSE))","v":"EVL720/О/40*40/ANT/ANT.U003"},null,"2210*1436*1098",null,65191]
["EVL721/О/40*40/",{"$f":"CONCATENATE(A102,VLOOKUP($J$4,'Цвет мет. опор'!A:B,2,0),\"/\",VLOOKUP($K$4,'Цвет лючка'!A:B,2,0),\".\",VLOOKUP($L$4,'Цвет столешницы'!A:B,2,FALSE))","v":"EVL721/О/40*40/ANT/ANT.U003"},"Стол письменный на О образном  м/к 40х40 со шкафом-купе\n(композиция двойной бенч+шкаф-купе)","1410*1240*1098","Шкаф купе приставной 1240х410х1098",42188]
["EVL722/О/40*40/",{"$f":"CONCATENATE(A103,VLOOKUP($J$4,'Цвет мет. опор'!A:B,2,0),\"/\",VLOOKUP($K$4,'Цвет лючка'!A:B,2,0),\".\",VLOOKUP($L$4,'Цвет столешницы'!A:B,2,FALSE))","v":"EVL722/О/40*40/ANT/ANT.U003"},null,"1610*1240*1098",null,43052]
["EVL723/О/40*40/",{"$f":"CONCATENATE(A104,VLOOKUP($J$4,'Цвет мет. опор'!A:B,2,0),\"/\",VLOOKUP($K$4,'Цвет лючка'!A:B,2,0),\".\",VLOOKUP($L$4,'Цвет столешницы'!A:B,2,FALSE))","v":"EVL723/О/40*40/ANT/ANT.U003"},null,"1810*1240*1098",null,43811]
["EVL724/О/40*40/",{"$f":"CONCATENATE(A105,VLOOKUP($J$4,'Цвет мет. опор'!A:B,2,0),\"/\",VLOOKUP($K$4,'Цвет лючка'!A:B,2,0),\".\",VLOOKUP($L$4,'Цвет столешницы'!A:B,2,FALSE))","v":"EVL724/О/40*40/ANT/ANT.U003"},null,"2010*1240*1098",null,44451]
["EVL725/О/40*40/",{"$f":"CONCATENATE(A106,VLOOKUP($J$4,'Цвет мет. опор'!A:B,2,0),\"/\",VLOOKUP($K$4,'Цвет лючка'!A:B,2,0),\".\",VLOOKUP($L$4,'Цвет столешницы'!A:B,2,FALSE))","v":"EVL725/О/40*40/ANT/ANT.U003"},null,"2210*1240*1098",null,45220]
["EVL726/О/40*40/",{"$f":"CONCATENATE(A107,VLOOKUP($J$4,'Цвет мет. опор'!A:B,2,0),\"/\",VLOOKUP($K$4,'Цвет лючка'!A:B,2,0),\".\",VLOOKUP($L$4,'Цвет столешницы'!A:B,2,FALSE))","v":"EVL726/О/40*40/ANT/ANT.U003"},"Рабочая станция на О образном  м/к 40х40 со шкафом-купе\n(композиция двойной бенч+шкаф-купе)","1410*2332*1098","шкафная группа\n2332х410х1098",82772]
["EVL727/О/40*40/",{"$f":"CONCATENATE(A108,VLOOKUP($J$4,'Цвет мет. опор'!A:B,2,0),\"/\",VLOOKUP($K$4,'Цвет лючка'!A:B,2,0),\".\",VLOOKUP($L$4,'Цвет столешницы'!A:B,2,FALSE))","v":"EVL727/О/40*40/ANT/ANT.U003"},null,"1610*2332*1098",null,83669]
["EVL728/О/40*40/",{"$f":"CONCATENATE(A109,VLOOKUP($J$4,'Цвет мет. опор'!A:B,2,0),\"/\",VLOOKUP($K$4,'Цвет лючка'!A:B,2,0),\".\",VLOOKUP($L$4,'Цвет столешницы'!A:B,2,FALSE))","v":"EVL728/О/40*40/ANT/ANT.U003"},null,"1810*2332*1098",null,86020]
["EVL729/О/40*40/",{"$f":"CONCATENATE(A110,VLOOKUP($J$4,'Цвет мет. опор'!A:B,2,0),\"/\",VLOOKUP($K$4,'Цвет лючка'!A:B,2,0),\".\",VLOOKUP($L$4,'Цвет столешницы'!A:B,2,FALSE))","v":"EVL729/О/40*40/ANT/ANT.U003"},null,"2010*2332*1098",null,87300]
["EVL730/О/40*40/",{"$f":"CONCATENATE(A111,VLOOKUP($J$4,'Цвет мет. опор'!A:B,2,0),\"/\",VLOOKUP($K$4,'Цвет лючка'!A:B,2,0),\".\",VLOOKUP($L$4,'Цвет столешницы'!A:B,2,FALSE))","v":"EVL730/О/40*40/ANT/ANT.U003"},null,"2210*2332*1098",null,88838]
["EVL731/О/40*40/",{"$f":"CONCATENATE(A112,VLOOKUP($J$4,'Цвет мет. опор'!A:B,2,0),\"/\",VLOOKUP($K$4,'Цвет лючка'!A:B,2,0),\".\",VLOOKUP($L$4,'Цвет столешницы'!A:B,2,FALSE))","v":"EVL731/О/40*40/ANT/ANT.U003"},"Рабочая станция на О образном  м/к 40х40 с  тумбой левая/правая","1450*1250*750 L","правый",33350]
["EVL732/О/40*40/",{"$f":"CONCATENATE(A113,VLOOKUP($J$4,'Цвет мет. опор'!A:B,2,0),\"/\",VLOOKUP($K$4,'Цвет лючка'!A:B,2,0),\".\",VLOOKUP($L$4,'Цвет столешницы'!A:B,2,FALSE))","v":"EVL732/О/40*40/ANT/ANT.U003"},null,"1450*1250*750 R",null,33350]
["EVL733/О/40*40/",{"$f":"CONCATENATE(A114,VLOOKUP($J$4,'Цвет мет. опор'!A:B,2,0),\"/\",VLOOKUP($K$4,'Цвет лючка'!A:B,2,0),\".\",VLOOKUP($L$4,'Цвет столешницы'!A:B,2,FALSE))","v":"EVL733/О/40*40/ANT/ANT.U003"},null,"1650*1250*750 L",null,33900]
["EVL734/О/40*40/",{"$f":"CONCATENATE(A115,VLOOKUP($J$4,'Цвет мет. опор'!A:B,2,0),\"/\",VLOOKUP($K$4,'Цвет лючка'!A:B,2,0),\".\",VLOOKUP($L$4,'Цвет столешницы'!A:B,2,FALSE))","v":"EVL734/О/40*40/ANT/ANT.U003"},null,"1650*1250*750 R",null,33900]
["EVL735/О/40*40/",{"$f":"CONCATENATE(A116,VLOOKUP($J$4,'Цвет мет. опор'!A:B,2,0),\"/\",VLOOKUP($K$4,'Цвет лючка'!A:B,2,0),\".\",VLOOKUP($L$4,'Цвет столешницы'!A:B,2,FALSE))","v":"EVL735/О/40*40/ANT/ANT.U003"},null,"1850*1250*750 L",null,35000]
["EVL736/О/40*40/",{"$f":"CONCATENATE(A117,VLOOKUP($J$4,'Цвет мет. опор'!A:B,2,0),\"/\",VLOOKUP($K$4,'Цвет лючка'!A:B,2,0),\".\",VLOOKUP($L$4,'Цвет столешницы'!A:B,2,FALSE))","v":"EVL736/О/40*40/ANT/ANT.U003"},null,"1850*1250*750 R",null,35000]
[null,"Бэнч-системы"]
["EVL645/О/40*40/",{"$f":"CONCATENATE(A119,VLOOKUP($J$4,'Цвет мет. опор'!A:B,2,0),\"/\",VLOOKUP($K$4,'Цвет лючка'!A:B,2,0),\".\",VLOOKUP($L$4,'Цвет столешницы'!A:B,2,FALSE))","v":"EVL645/О/40*40/ANT/ANT.U003"},"Рабочая станция на 2 раб.места на О образном  м/к 40х40 (бенч-система) глубиной 600","2400*600*750",null,34444]
["EVL646/О/40*40/",{"$f":"CONCATENATE(A120,VLOOKUP($J$4,'Цвет мет. опор'!A:B,2,0),\"/\",VLOOKUP($K$4,'Цвет лючка'!A:B,2,0),\".\",VLOOKUP($L$4,'Цвет столешницы'!A:B,2,FALSE))","v":"EVL646/О/40*40/ANT/ANT.U003"},null,"2800*600*750",null,35393]
["EVL647/О/40*40/",{"$f":"CONCATENATE(A121,VLOOKUP($J$4,'Цвет мет. опор'!A:B,2,0),\"/\",VLOOKUP($K$4,'Цвет лючка'!A:B,2,0),\".\",VLOOKUP($L$4,'Цвет столешницы'!A:B,2,FALSE))","v":"EVL647/О/40*40/ANT/ANT.U003"},null,"3200*600*750",null,37149]
["EVL648/О/40*40/",{"$f":"CONCATENATE(A122,VLOOKUP($J$4,'Цвет мет. опор'!A:B,2,0),\"/\",VLOOKUP($K$4,'Цвет лючка'!A:B,2,0),\".\",VLOOKUP($L$4,'Цвет столешницы'!A:B,2,FALSE))","v":"EVL648/О/40*40/ANT/ANT.U003"},"Рабочая станция на 2 раб.места на О образном  м/к 40х40 (бенч-система) глубиной 700","2400*700*750",null,38363]
["EVL649/О/40*40/",{"$f":"CONCATENATE(A123,VLOOKUP($J$4,'Цвет мет. опор'!A:B,2,0),\"/\",VLOOKUP($K$4,'Цвет лючка'!A:B,2,0),\".\",VLOOKUP($L$4,'Цвет столешницы'!A:B,2,FALSE))","v":"EVL649/О/40*40/ANT/ANT.U003"},null,"2800*700*750",null,40062]
["EVL650/О/40*40/",{"$f":"CONCATENATE(A124,VLOOKUP($J$4,'Цвет мет. опор'!A:B,2,0),\"/\",VLOOKUP($K$4,'Цвет лючка'!A:B,2,0),\".\",VLOOKUP($L$4,'Цвет столешницы'!A:B,2,FALSE))","v":"EVL650/О/40*40/ANT/ANT.U003"},null,"3200*700*750",null,41164]
["EVL651/О/40*40/",{"$f":"CONCATENATE(A125,VLOOKUP($J$4,'Цвет мет. опор'!A:B,2,0),\"/\",VLOOKUP($K$4,'Цвет лючка'!A:B,2,0),\".\",VLOOKUP($L$4,'Цвет столешницы'!A:B,2,FALSE))","v":"EVL651/О/40*40/ANT/ANT.U003"},"Рабочая станция на 2 раб.места на О образном  м/к 40х40 (бенч-система) глубиной 800","2400*800*750",null,36985]
["EVL652/О/40*40/",{"$f":"CONCATENATE(A126,VLOOKUP($J$4,'Цвет мет. опор'!A:B,2,0),\"/\",VLOOKUP($K$4,'Цвет лючка'!A:B,2,0),\".\",VLOOKUP($L$4,'Цвет столешницы'!A:B,2,FALSE))","v":"EVL652/О/40*40/ANT/ANT.U003"},null,"2800*800*750",null,38748]
["EVL653/О/40*40/",{"$f":"CONCATENATE(A127,VLOOKUP($J$4,'Цвет мет. опор'!A:B,2,0),\"/\",VLOOKUP($K$4,'Цвет лючка'!A:B,2,0),\".\",VLOOKUP($L$4,'Цвет столешницы'!A:B,2,FALSE))","v":"EVL653/О/40*40/ANT/ANT.U003"},null,"3200*800*750",null,40256]
["EVL654/О/40*40/",{"$f":"CONCATENATE(A128,VLOOKUP($J$4,'Цвет мет. опор'!A:B,2,0),\"/\",VLOOKUP($K$4,'Цвет лючка'!A:B,2,0),\".\",VLOOKUP($L$4,'Цвет столешницы'!A:B,2,FALSE))","v":"EVL654/О/40*40/ANT/ANT.U003"},"Рабочая станция на 3 раб.места на О образном  м/к 40х40 (бенч-система), глубиной 600 мм","3600*600*750",null,49736]
["EVL655/О/40*40/",{"$f":"CONCATENATE(A129,VLOOKUP($J$4,'Цвет мет. опор'!A:B,2,0),\"/\",VLOOKUP($K$4,'Цвет лючка'!A:B,2,0),\".\",VLOOKUP($L$4,'Цвет столешницы'!A:B,2,FALSE))","v":"EVL655/О/40*40/ANT/ANT.U003"},null,"4200*600*750",null,51161]
["EVL656/О/40*40/",{"$f":"CONCATENATE(A130,VLOOKUP($J$4,'Цвет мет. опор'!A:B,2,0),\"/\",VLOOKUP($K$4,'Цвет лючка'!A:B,2,0),\".\",VLOOKUP($L$4,'Цвет столешницы'!A:B,2,FALSE))","v":"EVL656/О/40*40/ANT/ANT.U003"},null,"4800*600*750",null,53793]
["EVL657/О/40*40/",{"$f":"CONCATENATE(A131,VLOOKUP($J$4,'Цвет мет. опор'!A:B,2,0),\"/\",VLOOKUP($K$4,'Цвет лючка'!A:B,2,0),\".\",VLOOKUP($L$4,'Цвет столешницы'!A:B,2,FALSE))","v":"EVL657/О/40*40/ANT/ANT.U003"},"Рабочая станция на 3 раб.места на О образном  м/к 40х40 (бенч-система), глубиной 700 мм","3600*700*750",null,57011]
["EVL658/О/40*40/",{"$f":"CONCATENATE(A132,VLOOKUP($J$4,'Цвет мет. опор'!A:B,2,0),\"/\",VLOOKUP($K$4,'Цвет лючка'!A:B,2,0),\".\",VLOOKUP($L$4,'Цвет столешницы'!A:B,2,FALSE))","v":"EVL658/О/40*40/ANT/ANT.U003"},null,"4200*700*750",null,59288]
["EVL659/О/40*40/",{"$f":"CONCATENATE(A133,VLOOKUP($J$4,'Цвет мет. опор'!A:B,2,0),\"/\",VLOOKUP($K$4,'Цвет лючка'!A:B,2,0),\".\",VLOOKUP($L$4,'Цвет столешницы'!A:B,2,FALSE))","v":"EVL659/О/40*40/ANT/ANT.U003"},null,"4800*700*750",null,61209]
["EVL660/О/40*40/",{"$f":"CONCATENATE(A134,VLOOKUP($J$4,'Цвет мет. опор'!A:B,2,0),\"/\",VLOOKUP($K$4,'Цвет лючка'!A:B,2,0),\".\",VLOOKUP($L$4,'Цвет столешницы'!A:B,2,FALSE))","v":"EVL660/О/40*40/ANT/ANT.U003"},"Рабочая станция на 3 раб.места на О образном  м/к 40х40 (бенч-система), глубиной 800 мм","3600*800*750",null,53048]
["EVL661/О/40*40/",{"$f":"CONCATENATE(A135,VLOOKUP($J$4,'Цвет мет. опор'!A:B,2,0),\"/\",VLOOKUP($K$4,'Цвет лючка'!A:B,2,0),\".\",VLOOKUP($L$4,'Цвет столешницы'!A:B,2,FALSE))","v":"EVL661/О/40*40/ANT/ANT.U003"},null,"4200*800*750",null,55962]
["EVL662/О/40*40/",{"$f":"CONCATENATE(A136,VLOOKUP($J$4,'Цвет мет. опор'!A:B,2,0),\"/\",VLOOKUP($K$4,'Цвет лючка'!A:B,2,0),\".\",VLOOKUP($L$4,'Цвет столешницы'!A:B,2,FALSE))","v":"EVL662/О/40*40/ANT/ANT.U003"},null,"4800*800*750",null,57957]
["EVL663/О/40*40/",{"$f":"CONCATENATE(A137,VLOOKUP($J$4,'Цвет мет. опор'!A:B,2,0),\"/\",VLOOKUP($K$4,'Цвет лючка'!A:B,2,0),\".\",VLOOKUP($L$4,'Цвет столешницы'!A:B,2,FALSE))","v":"EVL663/О/40*40/ANT/ANT.U003"},"Рабочая станция на 4 раб.места на О образном  м/к 40х40","2400*1236*750",null,60857]
["EVL664/О/40*40/",{"$f":"CONCATENATE(A138,VLOOKUP($J$4,'Цвет мет. опор'!A:B,2,0),\"/\",VLOOKUP($K$4,'Цвет лючка'!A:B,2,0),\".\",VLOOKUP($L$4,'Цвет столешницы'!A:B,2,FALSE))","v":"EVL664/О/40*40/ANT/ANT.U003"},null,"2800*1236*750",null,62757]
["EVL665/О/40*40/",{"$f":"CONCATENATE(A139,VLOOKUP($J$4,'Цвет мет. опор'!A:B,2,0),\"/\",VLOOKUP($K$4,'Цвет лючка'!A:B,2,0),\".\",VLOOKUP($L$4,'Цвет столешницы'!A:B,2,FALSE))","v":"EVL665/О/40*40/ANT/ANT.U003"},null,"3200*1236*750",null,66267]
["EVL666/О/40*40/",{"$f":"CONCATENATE(A140,VLOOKUP($J$4,'Цвет мет. опор'!A:B,2,0),\"/\",VLOOKUP($K$4,'Цвет лючка'!A:B,2,0),\".\",VLOOKUP($L$4,'Цвет столешницы'!A:B,2,FALSE))","v":"EVL666/О/40*40/ANT/ANT.U003"},"Рабочая станция на 4 раб.места на О образном  м/к 40х40","2400*1436*750",null,64063]
["EVL667/О/40*40/",{"$f":"CONCATENATE(A141,VLOOKUP($J$4,'Цвет мет. опор'!A:B,2,0),\"/\",VLOOKUP($K$4,'Цвет лючка'!A:B,2,0),\".\",VLOOKUP($L$4,'Цвет столешницы'!A:B,2,FALSE))","v":"EVL667/О/40*40/ANT/ANT.U003"},null,"2800*1436*750",null,67460]
["EVL668/О/40*40/",{"$f":"CONCATENATE(A142,VLOOKUP($J$4,'Цвет мет. опор'!A:B,2,0),\"/\",VLOOKUP($K$4,'Цвет лючка'!A:B,2,0),\".\",VLOOKUP($L$4,'Цвет столешницы'!A:B,2,FALSE))","v":"EVL668/О/40*40/ANT/ANT.U003"},null,"3200*1436*750",null,69665]
["EVL669/О/40*40/",{"$f":"CONCATENATE(A143,VLOOKUP($J$4,'Цвет мет. опор'!A:B,2,0),\"/\",VLOOKUP($K$4,'Цвет лючка'!A:B,2,0),\".\",VLOOKUP($L$4,'Цвет столешницы'!A:B,2,FALSE))","v":"EVL669/О/40*40/ANT/ANT.U003"},"Рабочая станция на 4 раб.места на О образном  м/к 40х40","2400*1636*750",null,65959]
["EVL670/О/40*40/",{"$f":"CONCATENATE(A144,VLOOKUP($J$4,'Цвет мет. опор'!A:B,2,0),\"/\",VLOOKUP($K$4,'Цвет лючка'!A:B,2,0),\".\",VLOOKUP($L$4,'Цвет столешницы'!A:B,2,FALSE))","v":"EVL670/О/40*40/ANT/ANT.U003"},null,"2800*1636*750",null,69484]
["EVL671/О/40*40/",{"$f":"CONCATENATE(A145,VLOOKUP($J$4,'Цвет мет. опор'!A:B,2,0),\"/\",VLOOKUP($K$4,'Цвет лючка'!A:B,2,0),\".\",VLOOKUP($L$4,'Цвет столешницы'!A:B,2,FALSE))","v":"EVL671/О/40*40/ANT/ANT.U003"},null,"3200*1636*750",null,72501]
["EVL672/О/40*40/",{"$f":"CONCATENATE(A146,VLOOKUP($J$4,'Цвет мет. опор'!A:B,2,0),\"/\",VLOOKUP($K$4,'Цвет лючка'!A:B,2,0),\".\",VLOOKUP($L$4,'Цвет столешницы'!A:B,2,FALSE))","v":"EVL672/О/40*40/ANT/ANT.U003"},"Рабочая станция на 6 раб.места на О образном м/к 40х40 с шириной 1-го рабочего места 600 мм","3600*1236*750",null,88261]
["EVL673/О/40*40/",{"$f":"CONCATENATE(A147,VLOOKUP($J$4,'Цвет мет. опор'!A:B,2,0),\"/\",VLOOKUP($K$4,'Цвет лючка'!A:B,2,0),\".\",VLOOKUP($L$4,'Цвет столешницы'!A:B,2,FALSE))","v":"EVL673/О/40*40/ANT/ANT.U003"},null,"4200*1236*750",null,91110]
["EVL674/О/40*40/",{"$f":"CONCATENATE(A148,VLOOKUP($J$4,'Цвет мет. опор'!A:B,2,0),\"/\",VLOOKUP($K$4,'Цвет лючка'!A:B,2,0),\".\",VLOOKUP($L$4,'Цвет столешницы'!A:B,2,FALSE))","v":"EVL674/О/40*40/ANT/ANT.U003"},null,"4800*1236*750",null,96376]
["EVL675/О/40*40/",{"$f":"CONCATENATE(A149,VLOOKUP($J$4,'Цвет мет. опор'!A:B,2,0),\"/\",VLOOKUP($K$4,'Цвет лючка'!A:B,2,0),\".\",VLOOKUP($L$4,'Цвет столешницы'!A:B,2,FALSE))","v":"EVL675/О/40*40/ANT/ANT.U003"},"Рабочая станция на 6 раб.места на О образном м/к 40х40 с шириной 1-го рабочего места 700 мм","3600*1436*750",null,92791]
["EVL676/О/40*40/",{"$f":"CONCATENATE(A150,VLOOKUP($J$4,'Цвет мет. опор'!A:B,2,0),\"/\",VLOOKUP($K$4,'Цвет лючка'!A:B,2,0),\".\",VLOOKUP($L$4,'Цвет столешницы'!A:B,2,FALSE))","v":"EVL676/О/40*40/ANT/ANT.U003"},null,"4200*1436*750",null,97886]
["EVL677/О/40*40/",{"$f":"CONCATENATE(A151,VLOOKUP($J$4,'Цвет мет. опор'!A:B,2,0),\"/\",VLOOKUP($K$4,'Цвет лючка'!A:B,2,0),\".\",VLOOKUP($L$4,'Цвет столешницы'!A:B,2,FALSE))","v":"EVL677/О/40*40/ANT/ANT.U003"},null,"4800*1436*750",null,101194]
["EVL678/О/40*40/",{"$f":"CONCATENATE(A152,VLOOKUP($J$4,'Цвет мет. опор'!A:B,2,0),\"/\",VLOOKUP($K$4,'Цвет лючка'!A:B,2,0),\".\",VLOOKUP($L$4,'Цвет столешницы'!A:B,2,FALSE))","v":"EVL678/О/40*40/ANT/ANT.U003"},"Рабочая станция на 6 раб.места на О образном м/к 40х40 с с шириной 1-го рабочего места 800 мм","3600*1636*750",null,65959]
["EVL679/О/40*40/",{"$f":"CONCATENATE(A153,VLOOKUP($J$4,'Цвет мет. опор'!A:B,2,0),\"/\",VLOOKUP($K$4,'Цвет лючка'!A:B,2,0),\".\",VLOOKUP($L$4,'Цвет столешницы'!A:B,2,FALSE))","v":"EVL679/О/40*40/ANT/ANT.U003"},null,"4200*1636*750",null,69484]
["EVL680/О/40*40/",{"$f":"CONCATENATE(A154,VLOOKUP($J$4,'Цвет мет. опор'!A:B,2,0),\"/\",VLOOKUP($K$4,'Цвет лючка'!A:B,2,0),\".\",VLOOKUP($L$4,'Цвет столешницы'!A:B,2,FALSE))","v":"EVL680/О/40*40/ANT/ANT.U003"},null,"4800*1636*750",null,72501]
[null,null,null,"Переговорные столы"]
["EVL800/О/40*40/",{"$f":"CONCATENATE(A156,VLOOKUP($J$4,'Цвет мет. опор'!A:B,2,0),\".\",VLOOKUP($L$4,'Цвет столешницы'!A:B,2,FALSE))","v":"EVL800/О/40*40/ANT.U003"},"Переговорный стол (1 столешница) \nна О образном  м/к 40х40","1000*1236*750",null,30678]
["EVL801/О/40*40/",{"$f":"CONCATENATE(A157,VLOOKUP($J$4,'Цвет мет. опор'!A:B,2,0),\".\",VLOOKUP($L$4,'Цвет столешницы'!A:B,2,FALSE))","v":"EVL801/О/40*40/ANT.U003"},null,"1200*1236*750",null,31919]
["EVL802/О/40*40/",{"$f":"CONCATENATE(A158,VLOOKUP($J$4,'Цвет мет. опор'!A:B,2,0),\".\",VLOOKUP($L$4,'Цвет столешницы'!A:B,2,FALSE))","v":"EVL802/О/40*40/ANT.U003"},null,"1400*1236*750",null,33392]
["EVL803/О/40*40/",{"$f":"CONCATENATE(A159,VLOOKUP($J$4,'Цвет мет. опор'!A:B,2,0),\".\",VLOOKUP($L$4,'Цвет столешницы'!A:B,2,FALSE))","v":"EVL803/О/40*40/ANT.U003"},null,"1600*1236*750",null,35288]
["EVL804/О/40*40/",{"$f":"CONCATENATE(A160,VLOOKUP($J$4,'Цвет мет. опор'!A:B,2,0),\".\",VLOOKUP($L$4,'Цвет столешницы'!A:B,2,FALSE))","v":"EVL804/О/40*40/ANT.U003"},null,"1800*1236*750",null,37226]
["EVL805/О/40*40/",{"$f":"CONCATENATE(A161,VLOOKUP($J$4,'Цвет мет. опор'!A:B,2,0),\".\",VLOOKUP($L$4,'Цвет столешницы'!A:B,2,FALSE))","v":"EVL805/О/40*40/ANT.U003"},"Переговорный стол (2 столешницы)\n на О образном  м/к 40х40","2000*1236*750",null,52022]
["EVL806/О/40*40/",{"$f":"CONCATENATE(A162,VLOOKUP($J$4,'Цвет мет. опор'!A:B,2,0),\".\",VLOOKUP($L$4,'Цвет столешницы'!A:B,2,FALSE))","v":"EVL806/О/40*40/ANT.U003"},null,"2400*1236*750",null,54115]
["EVL807/О/40*40/",{"$f":"CONCATENATE(A163,VLOOKUP($J$4,'Цвет мет. опор'!A:B,2,0),\".\",VLOOKUP($L$4,'Цвет столешницы'!A:B,2,FALSE))","v":"EVL807/О/40*40/ANT.U003"},null,"2800*1236*750",null,56608]
["EVL808/О/40*40/",{"$f":"CONCATENATE(A164,VLOOKUP($J$4,'Цвет мет. опор'!A:B,2,0),\".\",VLOOKUP($L$4,'Цвет столешницы'!A:B,2,FALSE))","v":"EVL808/О/40*40/ANT.U003"},null,"3200*1236*750",null,66771]
["EVL809/О/40*40/",{"$f":"CONCATENATE(A165,VLOOKUP($J$4,'Цвет мет. опор'!A:B,2,0),\".\",VLOOKUP($L$4,'Цвет столешницы'!A:B,2,FALSE))","v":"EVL809/О/40*40/ANT.U003"},null,"3600*1236*750",null,70560]
["EVL810/О/40*40/",{"$f":"CONCATENATE(A166,VLOOKUP($J$4,'Цвет мет. опор'!A:B,2,0),\".\",VLOOKUP($L$4,'Цвет столешницы'!A:B,2,FALSE))","v":"EVL810/О/40*40/ANT.U003"},"Переговорный стол (3 столешницы)\n на О образном  м/к 40х40","3000*1236*750",null,72251]
["EVL811/О/40*40/",{"$f":"CONCATENATE(A167,VLOOKUP($J$4,'Цвет мет. опор'!A:B,2,0),\".\",VLOOKUP($L$4,'Цвет столешницы'!A:B,2,FALSE))","v":"EVL811/О/40*40/ANT.U003"},null,"3600*1236*750",null,79164]
["EVL812/О/40*40/",{"$f":"CONCATENATE(A168,VLOOKUP($J$4,'Цвет мет. опор'!A:B,2,0),\".\",VLOOKUP($L$4,'Цвет столешницы'!A:B,2,FALSE))","v":"EVL812/О/40*40/ANT.U003"},null,"4200*1236*750",null,82904]
["EVL813/О/40*40/",{"$f":"CONCATENATE(A169,VLOOKUP($J$4,'Цвет мет. опор'!A:B,2,0),\".\",VLOOKUP($L$4,'Цвет столешницы'!A:B,2,FALSE))","v":"EVL813/О/40*40/ANT.U003"},null,"4800*1236*750",null,85336]
["EVL814/О/40*40/",{"$f":"CONCATENATE(A170,VLOOKUP($J$4,'Цвет мет. опор'!A:B,2,0),\".\",VLOOKUP($L$4,'Цвет столешницы'!A:B,2,FALSE))","v":"EVL814/О/40*40/ANT.U003"},null,"5400*1236*750",null,88431]
["EVL841/О/40*40/",{"$f":"CONCATENATE(A171,VLOOKUP($J$4,'Цвет мет. опор'!A:B,2,0),\".\",VLOOKUP($L$4,'Цвет столешницы'!A:B,2,FALSE))","v":"EVL841/О/40*40/ANT.U003"},"Переговорный стол (3 столешницы)\n на О-образном м/к 40х40","3600*1436*750",null,81586]
["EVL842/О/40*40/",{"$f":"CONCATENATE(A172,VLOOKUP($J$4,'Цвет мет. опор'!A:B,2,0),\".\",VLOOKUP($L$4,'Цвет столешницы'!A:B,2,FALSE))","v":"EVL842/О/40*40/ANT.U003"},null,"4200*1436*750",null,85434]
["EVL843/О/40*40/",{"$f":"CONCATENATE(A173,VLOOKUP($J$4,'Цвет мет. опор'!A:B,2,0),\".\",VLOOKUP($L$4,'Цвет столешницы'!A:B,2,FALSE))","v":"EVL843/О/40*40/ANT.U003"},null,"4800*1436*750",null,87965]
["EVL844/О/40*40/",{"$f":"CONCATENATE(A174,VLOOKUP($J$4,'Цвет мет. опор'!A:B,2,0),\".\",VLOOKUP($L$4,'Цвет столешницы'!A:B,2,FALSE))","v":"EVL844/О/40*40/ANT.U003"},null,"5400*1436*750",null,90096]
[null,null,"Кодировка Артикула стола"]
[null,null,"Модель стола разворот стола /Цвет опор/Цв. заглушки. Цвет столешницы  "]
[null,"МОДЕЛЬ СТОЛА (ФОРМА, РАЗМЕР)","ПРАВОСТОРОННИЙ /ЛЕВОСТОРОННИЙ","ЦВЕТ ОПОР","ЦВЕТ ЗАГЛУШКИ, РУЧЕК","ЦВЕТ СТОЛЕШНИЦЫ"]
[null,null,"SX-левый","АNT-АНТРАЦИТ","АNT-АНТРАЦИТ","H","Белый"]
[null,null,"DX-правый","WHT-БЕЛЫЙ ","H-БЕЛЫЙ ","U727 ","Серый Камень"]
[null,null,null,"GR-СЕРЫЙ","G-СЕРЫЙ","R2","Серый"]
[null,null,null,null,null,"ANT","Антрацит"]
[null,null,null,null,null,"U003","Дуб Честерфилд"]
[null,null,null,null,null,"L","Дуб 131"]

{"sheet":"Шкафы","index":8,"n_rows":65,"n_cols":12,"rows_kept":65,"cut":false,"hidden":false,"merged":[[1,8,2,11],[58,5,58,6],[58,2,58,3],[1,1,3,5],[55,1,55,5]]}
[null,"EVOLUTION",null,null,null,{"$f":"Склаская!F1","v":"2025-05-23"}]
[null,"Не складская программа производятся на заказ партией от 6 шт., со сроком по согласованию с производством, в цвете: Дуб Честерфилд, Белый, Антрацит, Серый R2, Дуб 131, Серый камень, Венге Цаво, Бетон. \nДля заказа изделия следует пользоваться правилами кодировки для создания  артикула. →→→→",null,null,null,null,null,null,"Формирование артикула \nв зависимости от выбранных характеристик"]
[]
[null,null,null,null,null,null,null,null,"Цвет корпуса шкафа","Цвет стекол","Цвет ручек","Цвет фасадов"]
[null,"АРТИКУЛ","ИЗДЕЛИЕ","НАИМЕНОВАНИЕ","РАЗМЕР (ДхШхВ),       мм","Розничная Цена, руб.",null,null,"Бетон","Тонированное","Антрацит","Дуб Честерфилд"]
["EVL400",{"$f":"CONCATENATE(A6,\".\",VLOOKUP($I$5,'Цвет корпуса шкафа'!A:B,2,0))","v":"EVL400.F186"},null,"Стеллаж высокий 800х2050","800х344х2052",13539]
["EVL401",{"$f":"CONCATENATE(A7,\"/\",VLOOKUP($I$5,'Цвет корпуса шкафа'!A:B,2,0),\"/\",VLOOKUP($J$5,'Цвет стекла'!A:B,2,0),\"/\",VLOOKUP($K$5,'Цвет лючка'!A:B,2,0),\".\",VLOOKUP($L$5,'Цвет столешницы'!A:B,2,FALSE))","v":"EVL401/F186/GRAFIT/ANT.U003"},null,"Шкаф для документов комбинированный 800х2050","800х364х2052",21425]
["EVL402",{"$f":"CONCATENATE(A8,\"/\",VLOOKUP($I$5,'Цвет корпуса шкафа'!A:B,2,0),\"/\",\"WHT\",\"/\",VLOOKUP($K$5,'Цвет лючка'!A:B,2,0),\".\",VLOOKUP($L$5,'Цвет столешницы'!A:B,2,FALSE))","v":"EVL402/F186/WHT/ANT.U003"},null,"Шкаф для документов комбинированный стекло в раме* 800х2050","800х364х2052",39909]
["EVL403",{"$f":"CONCATENATE(A9,\"/\",VLOOKUP($I$5,'Цвет корпуса шкафа'!A:B,2,0),\"/\",VLOOKUP($K$5,'Цвет лючка'!A:B,2,0),\".\",VLOOKUP($L$5,'Цвет столешницы'!A:B,2,FALSE))","v":"EVL403/F186/ANT.U003"},null,"Шкаф для документов (низ малые фасады, верх открытый) 800х2050","800х364х2052",14590]
["EVL404",{"$f":"CONCATENATE(A10,\"/\",VLOOKUP($I$5,'Цвет корпуса шкафа'!A:B,2,0),\"/\",VLOOKUP($K$5,'Цвет лючка'!A:B,2,0),\".\",VLOOKUP($L$5,'Цвет столешницы'!A:B,2,FALSE))","v":"EVL404/F186/ANT.U003"},null,"Шкаф для документов 4 двери с нишей 800х2050","800х364х2052",20378]
["EVL405",{"$f":"CONCATENATE(A11,\"/\",VLOOKUP($I$5,'Цвет корпуса шкафа'!A:B,2,0),\"/\",VLOOKUP($K$5,'Цвет лючка'!A:B,2,0),\".\",VLOOKUP($L$5,'Цвет столешницы'!A:B,2,FALSE))","v":"EVL405/F186/ANT.U003"},null,"Шкаф для документов с глухими фасадами (4 двери)800х2050","800х364х2052",20765]
["EVL406",{"$f":"CONCATENATE(A12,\"/\",VLOOKUP($I$5,'Цвет корпуса шкафа'!A:B,2,0),\"/\",VLOOKUP($K$5,'Цвет лючка'!A:B,2,0),\".\",VLOOKUP($L$5,'Цвет столешницы'!A:B,2,FALSE))","v":"EVL406/F186/ANT.U003"},null,"Шкаф для документов ( низ средние фасады, верх открытый) 800х2050","800х364х2052",15425]
["EVL407",{"$f":"CONCATENATE(A13,\"/\",VLOOKUP($I$5,'Цвет корпуса шкафа'!A:B,2,0),\"/\",VLOOKUP($K$5,'Цвет лючка'!A:B,2,0),\".\",VLOOKUP($L$5,'Цвет столешницы'!A:B,2,FALSE))","v":"EVL407/F186/ANT.U003"},null,"Шкаф для документов с глухими фасадами 800х2050","800х364х2052",17600]
["EVL408",{"$f":"CONCATENATE(A14,\"/\",VLOOKUP($I$5,'Цвет корпуса шкафа'!A:B,2,0),\"/\",VLOOKUP($K$5,'Цвет лючка'!A:B,2,0),\".\",VLOOKUP($L$5,'Цвет столешницы'!A:B,2,FALSE))","v":"EVL408/F186/ANT.U003"},null,"Шкаф для одежды с замком 800х2050","800х364х2052",19609]
["EVL409",{"$f":"CONCATENATE(A15,\"/\",VLOOKUP($I$5,'Цвет корпуса шкафа'!A:B,2,0),\"/\",VLOOKUP($K$5,'Цвет лючка'!A:B,2,0),\".\",VLOOKUP($L$5,'Цвет столешницы'!A:B,2,FALSE))","v":"EVL409/F186/ANT.U003"},null,"Шкаф для одежды с замком узкий 600х2050","600х364х2052",15780]
["EVL410",{"$f":"CONCATENATE(A16,\"/\",VLOOKUP($I$5,'Цвет корпуса шкафа'!A:B,2,0),\"/\",VLOOKUP($K$5,'Цвет лючка'!A:B,2,0),\".\",VLOOKUP($L$5,'Цвет столешницы'!A:B,2,FALSE))","v":"EVL410/F186/ANT.U003"},null,"Шкаф для одежды с замком глубокий 800х2050","800х600х2052",21611]
["EVL411",{"$f":"CONCATENATE(A17,\"/\",VLOOKUP($I$5,'Цвет корпуса шкафа'!A:B,2,0),\"/\",VLOOKUP($K$5,'Цвет лючка'!A:B,2,0),\".\",VLOOKUP($L$5,'Цвет столешницы'!A:B,2,FALSE))","v":"EVL411/F186/ANT.U003"},null,"Шкаф для одежды с замком глубокий узкий 600х2050","600х600х2052",20397]
["EVL412",{"$f":"CONCATENATE(A18,\"/\",VLOOKUP($K$5,'Цвет лючка'!A:B,2,0),\".\",VLOOKUP($L$5,'Цвет столешницы'!A:B,2,FALSE))","v":"EVL412/ANT.U003"},null,"Стеллаж высокий узкий 600х2050","600х364х2052",11710]
["EVL447",{"$f":"CONCATENATE(A19,\"/\",VLOOKUP($I$5,'Цвет корпуса шкафа'!A:B,2,0),\"/\",VLOOKUP($K$5,'Цвет лючка'!A:B,2,0),\".\",VLOOKUP($L$5,'Цвет столешницы'!A:B,2,FALSE))","v":"EVL447/F186/ANT.U003"},null,"Шкаф под документы высокий узкий 600х2050","600х364х2052",15635]
["EVL413",{"$f":"CONCATENATE(A20,\"/\",VLOOKUP($I$5,'Цвет корпуса шкафа'!A:B,2,0),\"/\",VLOOKUP($K$5,'Цвет лючка'!A:B,2,0),\".\",VLOOKUP($L$5,'Цвет столешницы'!A:B,2,FALSE))","v":"EVL413/F186/ANT.U003"},null,"Шкаф для документов узкий (низ средний фасад, верх открытый) 600х2050","600х364х2052",14639]
["EVL414",{"$f":"CONCATENATE(A21,\"/\",VLOOKUP($I$5,'Цвет корпуса шкафа'!A:B,2,0),\"/\",VLOOKUP($K$5,'Цвет лючка'!A:B,2,0),\".\",VLOOKUP($L$5,'Цвет столешницы'!A:B,2,FALSE))","v":"EVL414/F186/ANT.U003"},null,"Шкаф для документов узкий 2 двери с нишей 600х2050","600х364х2052",15866]
["EVL415",{"$f":"CONCATENATE(A22,\".\",VLOOKUP($I$5,'Цвет корпуса шкафа'!A:B,2,0))","v":"EVL415.F186"},null,"Стеллаж средний","800х364х1250",8760]
["EVL416",{"$f":"CONCATENATE(A23,\"/\",VLOOKUP($I$5,'Цвет корпуса шкафа'!A:B,2,0),\"/\",VLOOKUP($K$5,'Цвет лючка'!A:B,2,0),\".\",VLOOKUP($L$5,'Цвет столешницы'!A:B,2,FALSE))","v":"EVL416/F186/ANT.U003"},null,"Шкаф для документов средний с глухими фасадами","800х364х1250",12850]
["EVL417",{"$f":"CONCATENATE(A24,\"/\",VLOOKUP($I$5,'Цвет корпуса шкафа'!A:B,2,0),\"/\",VLOOKUP($K$5,'Цвет лючка'!A:B,2,0),\".\",VLOOKUP($L$5,'Цвет столешницы'!A:B,2,FALSE))","v":"EVL417/F186/ANT.U003"},null,"Шкаф для документов средний с глухими фасадами и открытой нишей","800х364х1250",11897]
["EVL418",{"$f":"CONCATENATE(A25,\"/\",VLOOKUP($K$5,'Цвет лючка'!A:B,2,0),\".\",VLOOKUP($L$5,'Цвет столешницы'!A:B,2,FALSE))","v":"EVL418/ANT.U003"},null,"Шкаф средний со стеклянными фасадами","800х364х1250",14850]
["EVL419",{"$f":"CONCATENATE(A26,\"/\",VLOOKUP($I$5,'Цвет корпуса шкафа'!A:B,2,0),\"/\",VLOOKUP($K$5,'Цвет лючка'!A:B,2,0),\".\",VLOOKUP($L$5,'Цвет столешницы'!A:B,2,FALSE))","v":"EVL419/F186/ANT.U003"},null,"Шкаф средний со стеклянными фасадами в алюминиевой раме","800х364х1250",35681]
["EVL420",{"$f":"CONCATENATE(A27,\".\",VLOOKUP($I$5,'Цвет корпуса шкафа'!A:B,2,0))","v":"EVL420.F186"},null,"Cтеллаж средний узкий","600х364х1250",7678]
["EVL421",{"$f":"CONCATENATE(A28,\"/\",VLOOKUP($I$5,'Цвет корпуса шкафа'!A:B,2,0),\"/\",VLOOKUP($K$5,'Цвет лючка'!A:B,2,0),\".\",VLOOKUP($L$5,'Цвет столешницы'!A:B,2,FALSE))","v":"EVL421/F186/ANT.U003"},null,"Шкаф для документов средний узкий ( низ малый фасад, верх открытый) 600х1250","600х364х1250",9860]
["EVL422",{"$f":"CONCATENATE(A29,\"/\",VLOOKUP($I$5,'Цвет корпуса шкафа'!A:B,2,0),\"/\",VLOOKUP($K$5,'Цвет лючка'!A:B,2,0),\".\",VLOOKUP($L$5,'Цвет столешницы'!A:B,2,FALSE))","v":"EVL422/F186/ANT.U003"},null,"Шкаф для документов средний узкий с глухим фасадом 600х1250","600х364х1250",10606]
["EVL423",{"$f":"CONCATENATE(A30,\"/\",VLOOKUP($I$5,'Цвет корпуса шкафа'!A:B,2,0),\"/\",VLOOKUP($K$5,'Цвет лючка'!A:B,2,0),\".\",VLOOKUP($L$5,'Цвет столешницы'!A:B,2,FALSE))","v":"EVL423/F186/ANT.U003"},null,"Шкаф низкий","800х364х870",9836]
["EVL424",{"$f":"CONCATENATE(A31,\".\",VLOOKUP($I$5,'Цвет корпуса шкафа'!A:B,2,0))","v":"EVL424.F186"},null,"Стеллаж низкий","800х364х870",6701]
["EVL425",{"$f":"CONCATENATE(A32,\".\",VLOOKUP($I$5,'Цвет корпуса шкафа'!A:B,2,0))","v":"EVL425.F186"},null,"Стеллаж низкий узкий","600х364х870",5856]
["EVL426",{"$f":"CONCATENATE(A33,\"/\",VLOOKUP($I$5,'Цвет корпуса шкафа'!A:B,2,0),\"/\",VLOOKUP($K$5,'Цвет лючка'!A:B,2,0),\".\",VLOOKUP($L$5,'Цвет столешницы'!A:B,2,FALSE))","v":"EVL426/F186/ANT.U003"},null,"Шкаф низкий узкий с глухой дверью","600х364х870",8039]
["EVL435SX",{"$f":"CONCATENATE(A34,\"/\",VLOOKUP($I$5,'Цвет корпуса шкафа'!A:B,2,0),\"/\",VLOOKUP($K$5,'Цвет лючка'!A:B,2,0),\".\",VLOOKUP($L$5,'Цвет столешницы'!A:B,2,FALSE))","v":"EVL435SX/F186/ANT.U003"},null,"Шкаф приставной двухсторонний левый","1440х410х1098",25980]
["EVL435DX",{"$f":"CONCATENATE(A35,\"/\",VLOOKUP($I$5,'Цвет корпуса шкафа'!A:B,2,0),\"/\",VLOOKUP($K$5,'Цвет лючка'!A:B,2,0),\".\",VLOOKUP($L$5,'Цвет столешницы'!A:B,2,FALSE))","v":"EVL435DX/F186/ANT.U003"},null,"Шкаф приставной двухсторонний правый","1440х410х1098",25980]
["EVL427",{"$f":"CONCATENATE(A36,\"/\",VLOOKUP($I$5,'Цвет корпуса шкафа'!A:B,2,0),\"/\",VLOOKUP($K$5,'Цвет лючка'!A:B,2,0),\".\",VLOOKUP($L$5,'Цвет столешницы'!A:B,2,FALSE))","v":"EVL427/F186/ANT.U003"},null,"Шкаф-купе приставной\n1040х1098","1120х410х1098",22375]
["EVL428",{"$f":"CONCATENATE(A37,\"/\",VLOOKUP($I$5,'Цвет корпуса шкафа'!A:B,2,0),\"/\",VLOOKUP($K$5,'Цвет лючка'!A:B,2,0),\".\",VLOOKUP($L$5,'Цвет столешницы'!A:B,2,FALSE))","v":"EVL428/F186/ANT.U003"},null,"Шкаф-купе приставной\n2332х1098","2332х410х1098",48973]
["EVL429",{"$f":"CONCATENATE(A38,\"/\",VLOOKUP($I$5,'Цвет корпуса шкафа'!A:B,2,0),\"/\",VLOOKUP($K$5,'Цвет лючка'!A:B,2,0),\".\",VLOOKUP($L$5,'Цвет столешницы'!A:B,2,FALSE))","v":"EVL429/F186/ANT.U003"},null,"Шкаф-купе приставной\n1240х1098","1240х410х1098",22949]
["EVL430",{"$f":"CONCATENATE(A39,\"/\",VLOOKUP($I$5,'Цвет корпуса шкафа'!A:B,2,0),\"/\",VLOOKUP($K$5,'Цвет лючка'!A:B,2,0),\".\",VLOOKUP($L$5,'Цвет столешницы'!A:B,2,FALSE))","v":"EVL430/F186/ANT.U003"},null,"Шкаф-купе приставной\n1440х1098","1440х410х1098",25326]
["EVL431",{"$f":"CONCATENATE(A40,\"/\",VLOOKUP($I$5,'Цвет корпуса шкафа'!A:B,2,0),\"/\",VLOOKUP($K$5,'Цвет лючка'!A:B,2,0),\".\",VLOOKUP($L$5,'Цвет столешницы'!A:B,2,FALSE))","v":"EVL431/F186/ANT.U003"},null,"Шкаф-купе приставной\n1640х1098","1640х410х1098",27840]
["EVL432",{"$f":"CONCATENATE(A41,\"/\",VLOOKUP($I$5,'Цвет корпуса шкафа'!A:B,2,0),\"/\",VLOOKUP($K$5,'Цвет лючка'!A:B,2,0),\".\",VLOOKUP($L$5,'Цвет столешницы'!A:B,2,FALSE))","v":"EVL432/F186/ANT.U003"},null,"Шкаф-купе приставной\n1240х750","1240х410х750",18486]
["EVL433",{"$f":"CONCATENATE(A42,\"/\",VLOOKUP($I$5,'Цвет корпуса шкафа'!A:B,2,0),\"/\",VLOOKUP($K$5,'Цвет лючка'!A:B,2,0),\".\",VLOOKUP($L$5,'Цвет столешницы'!A:B,2,FALSE))","v":"EVL433/F186/ANT.U003"},null,"Шкаф-купе приставной\n1440х750","1440х410х750",20464]
["EVL434",{"$f":"CONCATENATE(A43,\"/\",VLOOKUP($I$5,'Цвет корпуса шкафа'!A:B,2,0),\"/\",VLOOKUP($K$5,'Цвет лючка'!A:B,2,0),\".\",VLOOKUP($L$5,'Цвет столешницы'!A:B,2,FALSE))","v":"EVL434/F186/ANT.U003"},null,"Шкаф-купе приставной 1640х750","1640х410х750",26429]
["EVL436",{"$f":"CONCATENATE(A44,\"/\",VLOOKUP($I$5,'Цвет корпуса шкафа'!A:B,2,0),\"/\",VLOOKUP($K$5,'Цвет лючка'!A:B,2,0),\".\",VLOOKUP($L$5,'Цвет столешницы'!A:B,2,FALSE))","v":"EVL436/F186/ANT.U003"},null,"Локер на 25 ячеек (5х5 дверей) с ограничителем и обычным замком","2000х360х1850",75665]
["EVL901",{"$f":"CONCATENATE(A45,\"/\",VLOOKUP($I$5,'Цвет корпуса шкафа'!A:B,2,0),\"/\",VLOOKUP($K$5,'Цвет лючка'!A:B,2,0),\".\",VLOOKUP($L$5,'Цвет столешницы'!A:B,2,FALSE))","v":"EVL901/F186/ANT.U003"},null,"Стеллаж","1600х360х1850","Цена по запросу"]
["EVL437",{"$f":"CONCATENATE(A46,\".\",VLOOKUP($I$5,'Цвет корпуса шкафа'!A:B,2,0))","v":"EVL437.F186"},null,"Стеллаж ","600х400х2100","Цена по запросу"]
["EVL438",{"$f":"CONCATENATE(A47,\".\",VLOOKUP($I$5,'Цвет корпуса шкафа'!A:B,2,0))","v":"EVL438.F186"},null,"Стеллаж ","2500х400х2100",45849]
["EVL439",{"$f":"CONCATENATE(A48,\".\",VLOOKUP($I$5,'Цвет корпуса шкафа'!A:B,2,0))","v":"EVL439.F186"},null,"Стеллаж ","2000х400х2100",32757]
["EVL440",{"$f":"CONCATENATE(A49,\".\",VLOOKUP($I$5,'Цвет корпуса шкафа'!A:B,2,0))","v":"EVL440.F186"},null," Стеллаж ","1500х400х2100",31896]
["EVL441",{"$f":"CONCATENATE(A50,\".\",VLOOKUP($I$5,'Цвет корпуса шкафа'!A:B,2,0))","v":"EVL441.F186"},null,"Стеллаж боковой средний ","320х364х1233",5898]
["EVL442",{"$f":"CONCATENATE(A51,\".\",VLOOKUP($I$5,'Цвет корпуса шкафа'!A:B,2,0))","v":"EVL442.F186"},null,"Стеллаж боковой высокий  ","320х364х2035",10703]
["EVL443",{"$f":"CONCATENATE(A52,\".\",VLOOKUP($I$5,'Цвет корпуса шкафа'!A:B,2,0))","v":"EVL443.F186"},null,"Стеллаж промежуточный высокий ","600х364х2052",16078]
["EVL444",{"$f":"CONCATENATE(A53,\".\",VLOOKUP($I$5,'Цвет корпуса шкафа'!A:B,2,0))","v":"EVL444.F186"},null,"Стеллаж промежуточный высокий ","450х364х2052",14567]
["EVL445",{"$f":"CONCATENATE(A54,\".\",VLOOKUP($I$5,'Цвет корпуса шкафа'!A:B,2,0))","v":"EVL445.F186"},null,"Стеллаж промежуточный средний ","600х364х1233",9288]
["EVL446",{"$f":"CONCATENATE(A55,\".\",VLOOKUP($I$5,'Цвет корпуса шкафа'!A:B,2,0))","v":"EVL446.F186"},null,"Стеллаж промежуточный средний ","450х364х1233",9108]
[null,"* для  модели шкафа EWL402 предусмотрено только белое матовое стекло в белой рамке"]
[null,null,"Кодировка Артикула шкафа"]
[null,null,"      Модель шкафа / Цвет корпуса / Цв. ручек. Цвет фасадов"]
[null,"МОДЕЛЬ шкафа","Цвет корпуса",null,"ЦВЕТ РУЧЕК","ЦВЕТ ФАСАДОВ"]
[null,null,"H","Белый","АNT-АНТРАЦИТ","H","Белый"]
[null,null,"U727 ","Серый Камень","H-БЕЛЫЙ ","U727 ","Серый Камень"]
[null,null,"R2","Серый","G-СЕРЫЙ","R2","Серый"]
[null,null,"ANT","Антрацит",null,"ANT","Антрацит"]
[null,null,"U003","Дуб Честерфилд",null,"U003","Дуб Честерфилд"]
[null,null,"L","Дуб 131",null,"L","Дуб 131"]

{"sheet":"Тумбы","index":9,"n_rows":45,"n_cols":14,"rows_kept":45,"cut":false,"hidden":false,"merged":[[38,1,39,1],[38,3,38,4],[1,1,2,5],[1,10,1,13],[38,6,38,9]]}
[null,"EVOLUTION",null,null,null,{"$f":"Склаская!F1","v":"2025-05-23"}]
[null,"Не складская программа производятся на заказ партией от 6 шт., со сроком по согласованию с производством, в цвете: Дуб Честерфилд, Белый, Антрацит, Серый R2, Дуб 131, Серый камень, Венге Цаво, Бетон.\nДля заказа изделия следует пользоваться правилами кодировки для создания  артикула.→→→→",null,null,null,null,null,null,null,null,"Формирование артикула \nв зависимости от выбранных характеристик"]
[null,null,null,null,null,null,null,null,null,null,"Цвет корпуса","Цвет фасадов","Цвет ручек","Цвет топа тумбы"]
[null,"АРТИКУЛ","ИЗДЕЛИЕ","НАИМЕНОВАНИЕ","РАЗМЕР (ДхШхВ),       мм","Розничная Цена, руб.",null,null,null,null,"Антрацит","Антрацит","Антрацит","Дуб Честерфилд"]
["EVL300",{"$f":"CONCATENATE(A5,\"/\",VLOOKUP($K$4,'Цвет корпуса шкафа'!A:B,2,0),\"/\",VLOOKUP($L$4,'Цвет корпуса шкафа'!A:B,2,0),\"/\",VLOOKUP($M$4,'Цвет лючка'!A:B,2,0),\".\",VLOOKUP($N$4,'Цвет столешницы'!A:B,2,FALSE))","v":"EVL300/ANT/ANT/ANT.U003"},null,"Тумба приставная 450х600","450х600х750",13944]
["EVL301",{"$f":"CONCATENATE(A6,\"/\",VLOOKUP($K$4,'Цвет корпуса шкафа'!A:B,2,0),\"/\",VLOOKUP($L$4,'Цвет корпуса шкафа'!A:B,2,0),\"/\",VLOOKUP($M$4,'Цвет лючка'!A:B,2,0),\".\",VLOOKUP($N$4,'Цвет столешницы'!A:B,2,FALSE))","v":"EVL301/ANT/ANT/ANT.U003"},null,"Тумба приставная 450х700","450х700х750",15219]
["EVL302",{"$f":"CONCATENATE(A7,\"/\",VLOOKUP($K$4,'Цвет корпуса шкафа'!A:B,2,0),\"/\",VLOOKUP($L$4,'Цвет корпуса шкафа'!A:B,2,0),\"/\",VLOOKUP($M$4,'Цвет лючка'!A:B,2,0),\".\",VLOOKUP($N$4,'Цвет столешницы'!A:B,2,FALSE))","v":"EVL302/ANT/ANT/ANT.U003"},null,"Тумба приставная 450х800","450х800х750",14667]
["EVL303",{"$f":"CONCATENATE(A8,\"/\",VLOOKUP($K$4,'Цвет корпуса шкафа'!A:B,2,0),\"/\",VLOOKUP($L$4,'Цвет корпуса шкафа'!A:B,2,0),\"/\",VLOOKUP($M$4,'Цвет лючка'!A:B,2,0),\".\",VLOOKUP($N$4,'Цвет столешницы'!A:B,2,FALSE))","v":"EVL303/ANT/ANT/ANT.U003"},null,"Тумба приставная 450х1240","450х1240х750",25961]
["EVL304",{"$f":"CONCATENATE(A9,\"/\",VLOOKUP($K$4,'Цвет корпуса шкафа'!A:B,2,0),\"/\",VLOOKUP($L$4,'Цвет корпуса шкафа'!A:B,2,0),\"/\",VLOOKUP($M$4,'Цвет лючка'!A:B,2,0),\".\",VLOOKUP($N$4,'Цвет столешницы'!A:B,2,FALSE))","v":"EVL304/ANT/ANT/ANT.U003"},null,"Тумба приставная 450х1440","450х1440х750",26561]
["EVL305",{"$f":"CONCATENATE(A10,\"/\",VLOOKUP($K$4,'Цвет корпуса шкафа'!A:B,2,0),\"/\",VLOOKUP($L$4,'Цвет корпуса шкафа'!A:B,2,0),\"/\",VLOOKUP($M$4,'Цвет лючка'!A:B,2,0),\".\",VLOOKUP($N$4,'Цвет столешницы'!A:B,2,FALSE))","v":"EVL305/ANT/ANT/ANT.U003"},null,"Тумба приставная 450х1640","450х1640х750",27357]
["EVL306",{"$f":"CONCATENATE(A11,\"/\",VLOOKUP($K$4,'Цвет корпуса шкафа'!A:B,2,0),\"/\",VLOOKUP($L$4,'Цвет корпуса шкафа'!A:B,2,0),\"/\",VLOOKUP($M$4,'Цвет лючка'!A:B,2,0),\".\",VLOOKUP($N$4,'Цвет столешницы'!A:B,2,FALSE))","v":"EVL306/ANT/ANT/ANT.U003"},null,"Тумба мобильная на колёсах 4 ящика 750 замок на верхний ящик","450х475х750",13385]
["EVL307",{"$f":"CONCATENATE(A12,\"/\",VLOOKUP($K$4,'Цвет корпуса шкафа'!A:B,2,0),\"/\",VLOOKUP($L$4,'Цвет корпуса шкафа'!A:B,2,0),\"/\",VLOOKUP($M$4,'Цвет лючка'!A:B,2,0),\".\",VLOOKUP($N$4,'Цвет столешницы'!A:B,2,FALSE))","v":"EVL307/ANT/ANT/ANT.U003"},null,"Тумба мобильная на колёсах 3 ящика EVL307замок на верхний ящик","450х475х570",10590]
["EVL308",{"$f":"CONCATENATE(A13,\"/\",VLOOKUP($K$4,'Цвет корпуса шкафа'!A:B,2,0),\"/\",VLOOKUP($L$4,'Цвет корпуса шкафа'!A:B,2,0),\"/\",VLOOKUP($M$4,'Цвет лючка'!A:B,2,0),\".\",VLOOKUP($N$4,'Цвет столешницы'!A:B,2,FALSE))","v":"EVL308/ANT/ANT/ANT.U003"},null,"Тумба приставная  4 ящика 450х475 замок на верхний ящик","450х475х750",13251]
["EVL309",{"$f":"CONCATENATE(A14,\"/\",VLOOKUP($K$4,'Цвет корпуса шкафа'!A:B,2,0),\"/\",VLOOKUP($L$4,'Цвет корпуса шкафа'!A:B,2,0),\"/\",VLOOKUP($M$4,'Цвет лючка'!A:B,2,0),\".\",VLOOKUP($N$4,'Цвет столешницы'!A:B,2,FALSE))","v":"EVL309/ANT/ANT/ANT.U003"},null,"Тумба приставная  4 ящика 790х475 замок на верхний ящик","790х475х750",14863]
["EVL310",{"$f":"CONCATENATE(A15,\"/\",VLOOKUP($K$4,'Цвет корпуса шкафа'!A:B,2,0),\"/\",VLOOKUP($L$4,'Цвет корпуса шкафа'!A:B,2,0),\"/\",VLOOKUP($M$4,'Цвет лючка'!A:B,2,0),\".\",VLOOKUP($N$4,'Цвет столешницы'!A:B,2,FALSE))","v":"EVL310/ANT/ANT/ANT.U003"},null,"Тумба мобильная на колёсах 3 ящика с центральным замком","450х475х570",11051]
["EVL311",{"$f":"CONCATENATE(A16,\"/\",VLOOKUP($K$4,'Цвет корпуса шкафа'!A:B,2,0),\"/\",VLOOKUP($L$4,'Цвет корпуса шкафа'!A:B,2,0),\"/\",VLOOKUP($M$4,'Цвет лючка'!A:B,2,0),\".\",VLOOKUP($N$4,'Цвет столешницы'!A:B,2,FALSE))","v":"EVL311/ANT/ANT/ANT.U003"},null,"Тумба сервисная универсальная 880","880х475х570",14696]
["EVL312",{"$f":"CONCATENATE(A17,\"/\",VLOOKUP($K$4,'Цвет корпуса шкафа'!A:B,2,0),\"/\",VLOOKUP($L$4,'Цвет корпуса шкафа'!A:B,2,0),\"/\",VLOOKUP($M$4,'Цвет лючка'!A:B,2,0),\".\",VLOOKUP($N$4,'Цвет столешницы'!A:B,2,FALSE))","v":"EVL312/ANT/ANT/ANT.U003"},null,"Тумба сервисная универсальная 1140","1140х475х570",18421]
["EVL293",{"$f":"CONCATENATE(A18,\"/\",VLOOKUP($M$4,'Цвет лючка'!A:B,2,0),\".\",VLOOKUP($K$4,'Цвет корпуса шкафа'!A:B,2,0))","v":"EVL293/ANT.ANT"},null,"Контейнер подвесной с 1 ящиком Тип - 2\n(замок на ящик)\nФасады, корпус - Антрацит, ручки Антрацит","448х478х166",4105]
["EVL294",{"$f":"CONCATENATE(A19,\"/\",VLOOKUP($M$4,'Цвет лючка'!A:B,2,0),\".\",VLOOKUP($K$4,'Цвет корпуса шкафа'!A:B,2,0))","v":"EVL294/ANT.ANT"},null,"Контейнер подвесной с 2 ящиками Тип - 2\n(замок на верхний ящик)\nФасады, корпус - Антрацит, ручки Антрацит","448х478х296",6155]
["EVL290",{"$f":"CONCATENATE(A20,\"/\",VLOOKUP($M$4,'Цвет лючка'!A:B,2,0),\".\",VLOOKUP($K$4,'Цвет корпуса шкафа'!A:B,2,0))","v":"EVL290/ANT.ANT"},null,"Контейнер подвесной с 1 ящиком \n(замок на верхний ящик)","448х478х208",4931]
["EVL291",{"$f":"CONCATENATE(A21,\"/\",VLOOKUP($M$4,'Цвет лючка'!A:B,2,0),\".\",VLOOKUP($K$4,'Цвет корпуса шкафа'!A:B,2,0))","v":"EVL291/ANT.ANT"},null,"Контейнер подвесной с 2 ящиками\n(замок на верхний ящик)","448х478х346",7469]
["EVL292",{"$f":"CONCATENATE(A22,\"/\",VLOOKUP($M$4,'Цвет лючка'!A:B,2,0),\".\",VLOOKUP($K$4,'Цвет корпуса шкафа'!A:B,2,0))","v":"EVL292/ANT.ANT"},null,"Контейнер подвесной с 3-мя ящиками","448x478x435",8872]
["EVL903",{"$f":"CONCATENATE(A23,\"/\",VLOOKUP($K$4,'Цвет корпуса шкафа'!A:B,2,0),\"/\",VLOOKUP($L$4,'Цвет корпуса шкафа'!A:B,2,0),\"/\",VLOOKUP($M$4,'Цвет лючка'!A:B,2,0),\".\",VLOOKUP($N$4,'Цвет столешницы'!A:B,2,FALSE))","v":"EVL903/ANT/ANT/ANT.U003"},null,"Оргтауэр низкий ","390х700х750",15426]
["EVL913",{"$f":"CONCATENATE(A24,\"/\",VLOOKUP($K$4,'Цвет корпуса шкафа'!A:B,2,0),\"/\",VLOOKUP($L$4,'Цвет корпуса шкафа'!A:B,2,0),\"/\",VLOOKUP($M$4,'Цвет лючка'!A:B,2,0),\".\",VLOOKUP($N$4,'Цвет столешницы'!A:B,2,FALSE))","v":"EVL913/ANT/ANT/ANT.U003"},null,"Оргтауэр высокий","390х700х1100",16617]
["EVL906",{"$f":"CONCATENATE(A25,\"/\",VLOOKUP($K$4,'Цвет корпуса шкафа'!A:B,2,0),\"/\",VLOOKUP($L$4,'Цвет корпуса шкафа'!A:B,2,0),\"/\",VLOOKUP($M$4,'Цвет лючка'!A:B,2,0),\".\",VLOOKUP($N$4,'Цвет столешницы'!A:B,2,FALSE))","v":"EVL906/ANT/ANT/ANT.U003"},null,"Приставка с нишей под системный блок","300х1800х750",9600]
["EVL908",{"$f":"CONCATENATE(A26,\"/\",VLOOKUP($K$4,'Цвет корпуса шкафа'!A:B,2,0),\"/\",VLOOKUP($L$4,'Цвет корпуса шкафа'!A:B,2,0),\"/\",VLOOKUP($M$4,'Цвет лючка'!A:B,2,0),\".\",VLOOKUP($N$4,'Цвет столешницы'!A:B,2,FALSE))","v":"EVL908/ANT/ANT/ANT.U003"},null,"Тумба-стеллаж разделительный\nглубиной 420","1650х420х1600",45670]
["EVL902DX",{"$f":"CONCATENATE(A27,\"/\",VLOOKUP($K$4,'Цвет корпуса шкафа'!A:B,2,0),\"/\",VLOOKUP($L$4,'Цвет корпуса шкафа'!A:B,2,0),\"/\",VLOOKUP($M$4,'Цвет лючка'!A:B,2,0))","v":"EVL902DX/ANT/ANT/ANT"},null,"Приставная тумба \nправая\n(изготавливается полностью в BASE)","1400х480х750","Цена \nпо запросу"]
["EVL902SX",{"$f":"CONCATENATE(A28,\"/\",VLOOKUP($K$4,'Цвет корпуса шкафа'!A:B,2,0),\"/\",VLOOKUP($L$4,'Цвет корпуса шкафа'!A:B,2,0),\"/\",VLOOKUP($M$4,'Цвет лючка'!A:B,2,0))","v":"EVL902SX/ANT/ANT/ANT"},null,"Приставная тумба \nлевая\n(изготавливается полностью в BASE)","1400х480х750","Цена \nпо запросу"]
["EVL914DX",{"$f":"CONCATENATE(A29,\"/\",VLOOKUP($K$4,'Цвет корпуса шкафа'!A:B,2,0),\"/\",VLOOKUP($L$4,'Цвет корпуса шкафа'!A:B,2,0),\"/\",VLOOKUP($M$4,'Цвет лючка'!A:B,2,0),\".\",VLOOKUP($N$4,'Цвет столешницы'!A:B,2,FALSE))","v":"EVL914DX/ANT/ANT/ANT.U003"},null,"Надстройка тумбы \nправая","1400х480х350",8401.8000000000011]
["EVL914SX",{"$f":"CONCATENATE(A30,\"/\",VLOOKUP($K$4,'Цвет корпуса шкафа'!A:B,2,0),\"/\",VLOOKUP($L$4,'Цвет корпуса шкафа'!A:B,2,0),\"/\",VLOOKUP($M$4,'Цвет лючка'!A:B,2,0),\".\",VLOOKUP($N$4,'Цвет столешницы'!A:B,2,FALSE))","v":"EVL914SX/ANT/ANT/ANT.U003"},null,"Надстройка тумбы \nлевая","1400х480х35",8401.8000000000011]
["EVL910",{"$f":"CONCATENATE(A31,\"/\",VLOOKUP($K$4,'Цвет корпуса шкафа'!A:B,2,0),\"/\",VLOOKUP($L$4,'Цвет корпуса шкафа'!A:B,2,0),\"/\",VLOOKUP($M$4,'Цвет лючка'!A:B,2,0),\".\",VLOOKUP($N$4,'Цвет столешницы'!A:B,2,FALSE))","v":"EVL910/ANT/ANT/ANT.U003"},null,"Тумба приставная с ящиками","1400х480х1100",31398]
["EVL905",{"$f":"CONCATENATE(A32,\"/\",VLOOKUP($K$4,'Цвет корпуса шкафа'!A:B,2,0),\".\",VLOOKUP($N$4,'Цвет столешницы'!A:B,2,FALSE))","v":"EVL905/ANT.U003"},null,"Стеллаж настольный","350х1100х1100",9853]
["EVL914",{"$f":"CONCATENATE(A33,\"/\",VLOOKUP($K$4,'Цвет корпуса шкафа'!A:B,2,0),\".\",VLOOKUP($N$4,'Цвет столешницы'!A:B,2,FALSE))","v":"EVL914/ANT.U003"},null,"Блок ящиков для стеллажа настольного  EVL914","-",8402]
["EVL915",{"$f":"CONCATENATE(A34,\"/\",VLOOKUP($K$4,'Цвет корпуса шкафа'!A:B,2,0),\".\",VLOOKUP($N$4,'Цвет столешницы'!A:B,2,FALSE))","v":"EVL915/ANT.U003"},null,"Блок с дверью для стеллажа настольного EVL915","-",3701.5000000000005]
["EVL905",{"$f":"CONCATENATE(A35,\"/\",VLOOKUP($K$4,'Цвет корпуса шкафа'!A:B,2,0),\".\",VLOOKUP($N$4,'Цвет столешницы'!A:B,2,FALSE),\"+EVL914+EVL915\")","v":"EVL905/ANT.U003+EVL914+EVL915"},null,"Стеллаж настольный\n+ Блок ящиков\n+Блок с дверью для стеллажа настольного ","350х1100х1100",21957]
["EVL915",{"$f":"CONCATENATE(A36,\"/\",VLOOKUP($K$4,'Цвет корпуса шкафа'!A:B,2,0),\"/\",VLOOKUP($L$4,'Цвет корпуса шкафа'!A:B,2,0),\"/\",VLOOKUP($M$4,'Цвет лючка'!A:B,2,0),\".\",VLOOKUP($N$4,'Цвет столешницы'!A:B,2,FALSE))","v":"EVL915/ANT/ANT/ANT.U003"},null,"Надстройка для двух приставных тумб","1400х450х350",3702]
["EVL992",{"$f":"CONCATENATE(A37,\".\",VLOOKUP($N$4,'Цвет столешницы'!A:B,2,FALSE))","v":"EVL992.U003"},null,"Цветочница","720х410x200",2632]
[null,"Кодировка Артикула","Модель тумбы/Цвет корпуса/Цвет фасадов/Цв. ручек.Цвет топа"]
[null,"Модель тумбы","Цвет корпуса","Цвет фасадов",null,"Цвет ручек.","Цвет топа"]
[null,null,"H           Белый","H","Белый","H         Белые","H","Белый",null,"Белый"]
[null,null,"U727     Серый Камень","U727 ","Серый Камень","ANT   Антрацит","U727 ","Серый Камень",null,"Серый Камень"]
[null,null,"R2          Серый","R2","Серый","G         СЕРЫЙ","R2","Серый",null,"Серый"]
[null,null,"ANT     Антрацит","ANT","Антрацит",null,"ANT","Антрацит",null,"Антрацит"]
[null,null,"U003   Дуб Честерфилд","U003","Дуб Честерфилд",null,"U003","Дуб Честерфилд",null,"Дуб Честерфилд"]
[null,null,"L           Дуб 131","L","Дуб 131",null,"L","Дуб 131",null,"Дуб 131"]

{"sheet":"Переговорные столы","index":10,"n_rows":33,"n_cols":12,"rows_kept":33,"cut":false,"hidden":false,"merged":[[26,4,26,5],[1,8,1,11],[10,3,13,3],[14,3,16,3],[17,3,18,3],[17,2,18,2],[1,1,2,5],[14,2,15,2],[10,2,11,2]]}
[null,"EVOLUTION",null,null,null,{"$f":"Склаская!F1","v":"2025-05-23"}]
[null,"Столы переговоров в цв. гамме ЛДСП производятся на заказ, (общая сумма заказа не менее 600 т.р. в розничных ценах в рамках  коллекции Evolution), со сроком по согласованию с производством. \nДля заказа изделия следует пользоваться правилами кодировки для создания  артикула.  →→→",null,null,null,null,null,null,"Формирование артикула \nв зависимости от выбранных характеристик"]
[null,null,null,null,null,null,null,null,"Цвет столешницы\n","Цвет опор и передней панели \n(для столов на деревянных опора)","Цвет кабель-канала","Цвет мет. опор\n(для столов на мет. опорах)"]
[null,"АРТИКУЛ","ИЗДЕЛИЕ","НАИМЕНОВАНИЕ","РАЗМЕР (ДхШхВ), мм","Розничная Цена, руб.",null,null,"Белый","Белый","Антрацит","Антрацит"]
["EVL817",{"$f":"CONCATENATE(A5,\"/\",VLOOKUP($J$4,'Цвет корпуса шкафа'!A:B,2,0),\".\",VLOOKUP($I$4,'Цвет столешницы'!A:B,2,FALSE))","v":"EVL817/H.H"},null,"Секция стола для переговоров радиусная ","Столешница, боковые опоры стола  – 25 мм, кромка ПВХ 2 мм. 80x80x75","Цена \nпо запросу"]
["EVL818",{"$f":"CONCATENATE(A6,\"/\",VLOOKUP($J$4,'Цвет корпуса шкафа'!A:B,2,0),\".\",VLOOKUP($I$4,'Цвет столешницы'!A:B,2,FALSE))","v":"EVL818/H.H"},null,"\nСекция стола для переговоров 0,8 м.","Столешница, боковые опоры стола  – 25 мм, кромка ПВХ 2 мм. 80x80x75","Цена \nпо запросу"]
["EVL819",{"$f":"CONCATENATE(A7,\"/\",VLOOKUP($J$4,'Цвет корпуса шкафа'!A:B,2,0),\".\",VLOOKUP($I$4,'Цвет столешницы'!A:B,2,FALSE))","v":"EVL819/H.H"},null,"\nСекция стола для переговоров 1 м.","Столешница, боковые опоры стола  – 25 мм, кромка ПВХ 2 мм. 100x80x75","Цена \nпо запросу"]
["EVL820",{"$f":"CONCATENATE(A8,\"/\",VLOOKUP($J$4,'Цвет корпуса шкафа'!A:B,2,0),\".\",VLOOKUP($I$4,'Цвет столешницы'!A:B,2,FALSE))","v":"EVL820/H.H"},null,"\nСекция стола для переговоров 1,2 м.","Столешница, боковые опоры стола  – 25 мм, кромка ПВХ 2 мм. 120x80x75","Цена \nпо запросу"]
["EVL825",{"$f":"CONCATENATE(A9,\"/\",VLOOKUP($J$4,'Цвет корпуса шкафа'!A:B,2,0),\".\",VLOOKUP($I$4,'Цвет столешницы'!A:B,2,FALSE))","v":"EVL825/H.H"},null,"Стол для переговоров\nD90 см","90x90x75",28027]
["EVL826",{"$f":"CONCATENATE(A10,\"/\",VLOOKUP($J$4,'Цвет корпуса шкафа'!A:B,2,0),\".\",VLOOKUP($I$4,'Цвет столешницы'!A:B,2,FALSE))","v":"EVL826/H.H"},null,"Стол для переговоров\n110х90 см","110x90x73.9","Цена \nпо запросу"]
["EVL821/П/60х30/",{"$f":"CONCATENATE(A11,\"/\",VLOOKUP($L$4,'Цвет мет. опор'!A:B,2,0),\"/\",VLOOKUP($K$4,'Цвет лючка'!A:B,2,0),\".\",VLOOKUP($I$4,'Цвет столешницы'!A:B,2,FALSE))","v":"EVL821/П/60х30//ANT/ANT.H"},null,"Стол для переговоров 2 м. на металлических опорах","200x100x75                      П-образная опора с сечением 60х30х2 мм\n\n  ",22788.7]
["EVL821/П/40х40/",{"$f":"CONCATENATE(A12,\"/\",VLOOKUP($L$4,'Цвет мет. опор'!A:B,2,0),\"/\",VLOOKUP($K$4,'Цвет лючка'!A:B,2,0),\".\",VLOOKUP($I$4,'Цвет столешницы'!A:B,2,FALSE))","v":"EVL821/П/40х40//ANT/ANT.H"},null,null,"П-образная опора с сечением 40х40 мм",22788.7]
["EVL821/А/60х30/",{"$f":"CONCATENATE(A13,\"/\",VLOOKUP($L$4,'Цвет мет. опор'!A:B,2,0),\"/\",VLOOKUP($K$4,'Цвет лючка'!A:B,2,0),\".\",VLOOKUP($I$4,'Цвет столешницы'!A:B,2,FALSE))","v":"EVL821/А/60х30//ANT/ANT.H"},null,null,"А-образная опора с сечением 60х30 мм ",23106.600000000002]
["EVL821/О/40х40",{"$f":"CONCATENATE(A14,\"/\",VLOOKUP($L$4,'Цвет мет. опор'!A:B,2,0),\"/\",VLOOKUP($K$4,'Цвет лючка'!A:B,2,0),\".\",VLOOKUP($I$4,'Цвет столешницы'!A:B,2,FALSE))","v":"EVL821/О/40х40/ANT/ANT.H"},null,null,"О-образная опора с сечением 40х40 мм","Цена \nпо запросу"]
["EVL822/П/60х30/",{"$f":"CONCATENATE(A15,\"/\",VLOOKUP($L$4,'Цвет мет. опор'!A:B,2,0),\"/\",VLOOKUP($K$4,'Цвет лючка'!A:B,2,0),\".\",VLOOKUP($I$4,'Цвет столешницы'!A:B,2,FALSE))","v":"EVL822/П/60х30//ANT/ANT.H"},null,"Стол для переговоров \n2,2 м. на металлических опорах","220x100x75\nП-образная опора с сечением 60х30 мм",24260.500000000004]
["EVL822/П/40х40",{"$f":"CONCATENATE(A16,\"/\",VLOOKUP($L$4,'Цвет мет. опор'!A:B,2,0),\"/\",VLOOKUP($K$4,'Цвет лючка'!A:B,2,0),\".\",VLOOKUP($I$4,'Цвет столешницы'!A:B,2,FALSE))","v":"EVL822/П/40х40/ANT/ANT.H"},null,null,"П-образная опора с сечением 40х40 мм","Цена \nпо запросу"]
["EVL822/А/60х30",{"$f":"CONCATENATE(A17,\"/\",VLOOKUP($L$4,'Цвет мет. опор'!A:B,2,0),\"/\",VLOOKUP($K$4,'Цвет лючка'!A:B,2,0),\".\",VLOOKUP($I$4,'Цвет столешницы'!A:B,2,FALSE))","v":"EVL822/А/60х30/ANT/ANT.H"},null,null,"А-образная опора с сечением 60х30 мм ",24267.100000000002]
["EVL822/О/40х40",{"$f":"CONCATENATE(A18,\"/\",VLOOKUP($L$4,'Цвет мет. опор'!A:B,2,0),\"/\",VLOOKUP($K$4,'Цвет лючка'!A:B,2,0),\".\",VLOOKUP($I$4,'Цвет столешницы'!A:B,2,FALSE))","v":"EVL822/О/40х40/ANT/ANT.H"},null,"Стол для переговоров \n2,2 м. на металлических опорах","О-образная опора с сечением 40х40 мм","Цена \nпо запросу"]
["EVL822/О/60х30/",{"$f":"CONCATENATE(A19,\"/\",VLOOKUP($L$4,'Цвет мет. опор'!A:B,2,0),\"/\",VLOOKUP($K$4,'Цвет лючка'!A:B,2,0),\".\",VLOOKUP($I$4,'Цвет столешницы'!A:B,2,FALSE))","v":"EVL822/О/60х30//ANT/ANT.H"},null,null,"О-образная опора с сечением 60х30 мм",25348.400000000001]
["EVL823/П/40х40",{"$f":"CONCATENATE(A20,\"/\",VLOOKUP($L$4,'Цвет мет. опор'!A:B,2,0),\"/\",VLOOKUP($K$4,'Цвет лючка'!A:B,2,0),\".\",VLOOKUP($I$4,'Цвет столешницы'!A:B,2,FALSE))","v":"EVL823/П/40х40/ANT/ANT.H"},"140x120x75","Стол для переговоров \n1,4 м. на металлических опорах","П-образная опора с сечением 40х40 мм","Цена \nпо запросу"]
["EVL824/П/40х40",{"$f":"CONCATENATE(A21,\"/\",VLOOKUP($L$4,'Цвет мет. опор'!A:B,2,0),\"/\",VLOOKUP($K$4,'Цвет лючка'!A:B,2,0),\".\",VLOOKUP($I$4,'Цвет столешницы'!A:B,2,FALSE))","v":"EVL824/П/40х40/ANT/ANT.H"},"360x120x75","Стол для переговоров \n3,6 м. на металлических опорах","П-образная опора с сечением 40х40 мм","Цена \nпо запросу"]
["EVL827",{"$f":"CONCATENATE(A22,\"/\",VLOOKUP($L$4,'Цвет мет. опор'!A:B,2,0),\".\",VLOOKUP($I$4,'Цвет столешницы'!A:B,2,FALSE))","v":"EVL827/ANT.H"},null,"Стол для переговоров\n90х90 см","90x90x73.9",28343.7]
["EVL815",{"$f":"CONCATENATE(A23,\"/\",VLOOKUP($J$4,'Цвет корпуса шкафа'!A:B,2,0),\".\",VLOOKUP($I$4,'Цвет столешницы'!A:B,2,FALSE))","v":"EVL815/H.H"},null,"Стол для переговоров 2 м.\nна ДСП опорах","200x90x75",11895.400000000001]
["EVL816",{"$f":"CONCATENATE(A24,\"/\",VLOOKUP($J$4,'Цвет корпуса шкафа'!A:B,2,0),\".\",VLOOKUP($I$4,'Цвет столешницы'!A:B,2,FALSE))","v":"EVL816/H.H"},null,"Стол для переговоров 2,2 м. на ДСП опорах","220x110x75",15477.000000000002]
[null,null,"Кодировка Артикула стола переговоров на металлических опорах"]
[null,null,"Модель стола /Цвет опор/Цв. заглушки. Цвет столешницы  "]
[null,"МОДЕЛЬ СТОЛА (ФОРМА, РАЗМЕР)","ЦВЕТ ОПОР","ЦВЕТ ЗАГЛУШКИ, РУЧЕК","ЦВЕТ СТОЛЕШНИЦЫ"]
[null,null,"АNT-АНТРАЦИТ","АNT-АНТРАЦИТ","Н","Белый"]
[null,null,"H-БЕЛЫЙ ","H-БЕЛЫЙ ","U727 ","Серый Камень"]
[null,null,"R2-СЕРЫЙ","G-СЕРЫЙ","R2","Серый"]
[null,null,null,null,"ANT","Антрацит"]
[null,null,null,null,"U003","Дуб Честерфилд"]
[null,null,null,null,"L","Дуб 131"]

{"sheet":"миникухни","index":11,"n_rows":14,"n_cols":11,"rows_kept":14,"cut":false,"hidden":false,"merged":[[2,8,2,10],[7,4,7,5],[7,2,7,3],[2,1,3,5]]}
[null,"EVOLUTION",null,null,null,{"$f":"Склаская!$F$1","v":"2025-05-23"}]
[null," Миникухня из ЛДСП: толщина топов и столешниц 25 мм, боковины 18 мм"]
[null,"Складская программа: фасады - Дуб Честерфилд, боковины, задняя стенка, полки, топ  - Дуб Честерфилд. Ручки - Антрацит.\nКухни в другой цв. гамме ЛДСП производятся на заказ (общая сумма заказа не менее 600 т.р. в розничных ценах в рамках  коллекции Evolution), со сроком по согласованию с производством. \nДля заказа изделия следует пользоваться правилами кодировки для создания  артикула.  →→→",null,null,null,null,null,null,"Формирование артикула \nв зависимости от выбранных характеристик"]
[null,null,null,null,null,null,null,null,"Цвет фасадов","Цвет корпуса","Цвет ручек"]
[null,"АРТИКУЛ","ИЗДЕЛИЕ","НАИМЕНОВАНИЕ","РАЗМЕР (ДхШхВ),       мм","Розничная Цена, руб.",null,null,"Дуб Честерфилд","Дуб Честерфилд","Антрацит"]
["EVL450",{"$f":"CONCATENATE(A6,\"/\",VLOOKUP($J$5,'Цвет корпуса шкафа'!A:B,2,0),\"/\",VLOOKUP($K$5,'Цвет лючка'!A:B,2,0),\".\",VLOOKUP($I$5,'Цвет столешницы'!A:B,2,FALSE))","v":"EVL450/U003/ANT.U003"},null,"миникухня","1000х620х2150",33198]
[null,"Кодировка АРТИКУЛА кухни:"]
[null,"     Модель кухни","     Цвет корпуса",null,"Цвет фасадов"]
[null,null,"H","Белый","H","Белый"]
[null,null,"SLT","Салтилло","U727 ","Серый Камень"]
[null,null,"R2","Серый","R2","Серый"]
[null,null,"ANT","Антрацит","ANT","Антрацит"]
[null,null,"U003","Дуб Честерфилд","U003","Дуб Честерфилд"]
[null,null,"L","Дуб 131","L","Дуб 131"]

{"sheet":"Экраны+Аксессуары","index":12,"n_rows":114,"n_cols":11,"rows_kept":114,"cut":false,"hidden":false,"merged":[[36,1,36,4],[86,2,89,2],[86,3,89,3],[50,0,50,4],[51,2,52,2],[53,2,55,2],[9,1,9,6],[18,1,18,6],[64,0,64,4],[58,2,59,2],[60,2,62,2],[57,0,57,4],[42,0,42,3],[43,0,43,4],[26,0,26,4],[31,1,31,4],[63,1,63,3],[65,2,66,2],[67,2,69,2],[0,8,0,10],[56,1,56,3],[30,1,30,3],[11,2,12,2],[13,2,15,2],[20,2,21,2],[22,2,24,2],[35,0,35,3],[38,2,40,2],[44,2,45,2],[46,2,48,2],[1,8,1,10],[1,1,1,7],[49,1,49,3],[25,1,25,3],[3,1,4,6],[109,2,113,2],[91,1,91,6],[92,3,93,3],[92,4,93,4],[92,2,93,2],[107,6,107,7],[107,4,107,5],[106,4,106,7],[92,5,93,5],[92,6,93,6]]}
[null,null,null,null,null,null,{"$f":"Склаская!$F$1","v":"2025-05-23"},null,"ВНИМАНИЕ! Для удобства клиентов в прайс-листе цены на фронтали и экраны указаны с учетом креплений. В счете ввиду особенностей 1С это будут отдельные позиции."]
[null,"EVOLUTION экраны, фронтали, экран-фронтали, крепеж и комплектующие",null,null,null,null,null,null,"Формирование артикула \nв зависимости от выбранных характеристик"]
[null,null,null,null,null,null,null,null,"Цвет экранов \nиз ткани","Цвет экранов и фронталей \nиз ЛДСП ","Цвет Фурнитуры"]
[null,"Не складская программа производятся на заказ партией от 6 шт., со сроком по согласованию с производством, в цвете: Дуб Честерфилд, Белый, Антрацит, Серый R2, Дуб 131, Серый камень, Венге Цаво, Бетон.\nДля заказа изделия следует пользоваться правилами кодировки для создания  артикула.  →→→",null,null,null,null,null,null,"Grey","Белый","Антрацит"]
[]
[null,"Экран-фронтали (ткань) для одиночного стола с креплением AKS161(кабель-канал с  креплением )"]
[]
[null,"Yellow(заказ)       Sand(заказ)         Mint(склад)         Ash(заказ)        Grey(склад)      Denim(заказ)  "]
[]
[null,"Для удобства клиентов цены изделий указаны вместе с креплением \n(в отгрузочных документах экран и крепление прописываются отдельно)↓"]
["АРТИКУЛ","АРТИКУЛ","ИЗДЕЛИЕ","НАИМЕНОВАНИЕ","РАЗМЕР (ДхШхВ),       мм","Розничная цена  без крепления, руб.","Розничная цена с креплением, руб."]
["EVL511",{"$f":"CONCATENATE(A12,\".\",VLOOKUP($I$4,'Цвет ткани'!A:B,2,0),\"+AKS161.\",VLOOKUP($K$4,'Цвет мет. опор'!A:B,2,0))","v":"EVL511.2+AKS161.ANT"},null,"Экран-фронталь стола 1000 (ткань) \nс креплением AKS161 ","850х750х22",7778,{"$f":"F12+$F$83","v":10501}]
["EVL500",{"$f":"CONCATENATE(A13,\".\",VLOOKUP($I$4,'Цвет ткани'!A:B,2,0),\"+AKS161.\",VLOOKUP($K$4,'Цвет мет. опор'!A:B,2,0))","v":"EVL500.2+AKS161.ANT"},null,"Экран-фронталь стола 1200 (ткань)  с креплением AKS161 ","1050х750х22",8382,{"$f":"F13+$F$83","v":11105}]
["EVL502",{"$f":"CONCATENATE(A14,\".\",VLOOKUP($I$4,'Цвет ткани'!A:B,2,0),\"+AKS161.\",VLOOKUP($K$4,'Цвет мет. опор'!A:B,2,0))","v":"EVL502.2+AKS161.ANT"},null,"Экран-фронталь стола 1400 (ткань)  с креплением AKS161","1250х750х22",9074,11797]
["EVL504",{"$f":"CONCATENATE(A15,\".\",VLOOKUP($I$4,'Цвет ткани'!A:B,2,0),\"+AKS161.\",VLOOKUP($K$4,'Цвет мет. опор'!A:B,2,0))","v":"EVL504.2+AKS161.ANT"},null,"Экран-фронталь стола 1600 (ткань)  с креплением AKS161 ","1450х750х22",12020,14743]
["EVL506",{"$f":"CONCATENATE(A16,\".\",VLOOKUP($I$4,'Цвет ткани'!A:B,2,0),\"+AKS161.\",VLOOKUP($K$4,'Цвет мет. опор'!A:B,2,0))","v":"EVL506.2+AKS161.ANT"},null,"Экран-фронталь стола 1800 (ткань)  с креплением AKS161 ","1650х750х22",13571,{"$f":"F16+$F$83","v":16294}]
[null,"Экран-фронтали (ЛДСП) для одиночного стола с креплением AKS161(кабель-канал с  креплением )"]
[]
[null,"Для удобства клиентов цены изделий указаны вместе с креплением \n(в отгрузочных документах экран и крепление прописываются отдельно)↓"]
["АРТИКУЛ","АРТИКУЛ","ИЗДЕЛИЕ","НАИМЕНОВАНИЕ","РАЗМЕР (ДхШхВ),       мм","Розничная цена  без крепления, руб.","Розничная цена с креплением, руб."]
["EVL511W",{"$f":"CONCATENATE(A21,\".\",VLOOKUP($J$4,'Цвет столешницы'!A:B,2),\"+AKS161.\",VLOOKUP($K$4,'Цвет мет. опор'!A:B,2,0))","v":"EVL511W.H+AKS161.ANT"},null,"Экран-фронталь стола 1000 (ЛДСП)  с креплением AKS161 ","850х750х18",3222,{"$f":"F21+$F$83","v":5945}]
["EVL500W",{"$f":"CONCATENATE(A22,\".\",VLOOKUP($J$4,'Цвет столешницы'!A:B,2),\"+AKS161.\",VLOOKUP($K$4,'Цвет мет. опор'!A:B,2,0))","v":"EVL500W.H+AKS161.ANT"},null,"Экран-фронталь стола 1200 (ЛДСП)  с креплением AKS161 ","1050х750х18",3847,{"$f":"F22+$F$83","v":6570}]
["EVL502W",{"$f":"CONCATENATE(A23,\".\",VLOOKUP($J$4,'Цвет столешницы'!A:B,2),\"+AKS161.\",VLOOKUP($K$4,'Цвет мет. опор'!A:B,2,0))","v":"EVL502W.H+AKS161.ANT"},null,"Экран-фронталь стола 1400 (ЛДСП)  с креплением AKS161 ","1250х750х18",4496,{"$f":"F23+$F$83","v":7219}]
["EVL504W",{"$f":"CONCATENATE(A24,\".\",VLOOKUP($J$4,'Цвет столешницы'!A:B,2),\"+AKS161.\",VLOOKUP($K$4,'Цвет мет. опор'!A:B,2,0))","v":"EVL504W.H+AKS161.ANT"},null,"Экран-фронталь стола 1600 (ЛДСП)  с креплением AKS161 ","1450х750х18",5145,{"$f":"F24+$F$83","v":7868}]
["EVL506W",{"$f":"CONCATENATE(A25,\".\",VLOOKUP($J$4,'Цвет столешницы'!A:B,2),\"+AKS161.\",VLOOKUP($K$4,'Цвет мет. опор'!A:B,2,0))","v":"EVL506W.H+AKS161.ANT"},null,"Экран-фронталь стола 1800 (ЛДСП)  с креплением AKS161 ","1650х750х18",5793,{"$f":"F25+$F$83","v":8516}]
[null,"Тканевые торцевые экраны с комплектом креплений  AKS177 (для торцевых экранов)"]
["Для удобства клиентов цены изделий указаны вместе с креплением \n(в отгрузочных документах экран и крепление прописываются отдельно)→",null,null,null,null,"Розничная цена  без крепления, руб.","Розничная цена с креплением, руб."]
["EVL508",{"$f":"CONCATENATE(A28,\".\",VLOOKUP($I$4,'Цвет ткани'!A:B,2,0),\"+AKS177.\",VLOOKUP($K$4,'Цвет мет. опор'!A:B,2,0))","v":"EVL508.2+AKS177.ANT"},null,"Экран торцевой 600, ткань, с креплением AKS167 ","600х350х22",3013,{"$f":"F28+$F$82","v":5887}]
["EVL509",{"$f":"CONCATENATE(A29,\".\",VLOOKUP($I$4,'Цвет ткани'!A:B,2,0),\"+AKS177.\",VLOOKUP($K$4,'Цвет мет. опор'!A:B,2,0))","v":"EVL509.2+AKS177.ANT"},null,"Экран торцевой 700, ткань, , с креплением AKS167  ","700х350х22",3922,{"$f":"F29+$F$82","v":6796}]
["EVL510",{"$f":"CONCATENATE(A30,\".\",VLOOKUP($I$4,'Цвет ткани'!A:B,2,0),\"+AKS177.\",VLOOKUP($K$4,'Цвет мет. опор'!A:B,2,0))","v":"EVL510.2+AKS177.ANT"},null,"Экран торцевой 800, ткань, с креплением AKS167  ","800х350х22",4232,{"$f":"F30+$F$82","v":7106}]
[null,"Экраны торцевые из ЛДСП   с комплектом креплений \nAKS177 (для торцевых экранов)"]
[null,"Для удобства клиентов цены изделий указаны вместе с креплением \n(в отгрузочных документах экран и крепление прописываются отдельно)→",null,null,null,"Розничная цена  без крепления, руб.","Розничная цена с креплением, руб."]
["EVL508W",{"$f":"CONCATENATE(A33,\".\",VLOOKUP($J$4,'Цвет столешницы'!A:B,2),\"+AKS177.\",VLOOKUP($K$4,'Цвет мет. опор'!A:B,2,0))","v":"EVL508W.H+AKS177.ANT"},null,"Экран торцевой 600, ЛДСП, с креплением AKS160  ","600х350х18",1212,{"$f":"F33+$F$82","v":4086}]
["EVL509W",{"$f":"CONCATENATE(A34,\".\",VLOOKUP($J$4,'Цвет столешницы'!A:B,2),\"+AKS177.\",VLOOKUP($K$4,'Цвет мет. опор'!A:B,2,0))","v":"EVL509W.H+AKS177.ANT"},null,"Экран торцевой 700, ЛДСП, с креплением AKS160   ","700х350х18",1396,{"$f":"F34+$F$82","v":4270}]
["EVL510W",{"$f":"CONCATENATE(A35,\".\",VLOOKUP($J$4,'Цвет столешницы'!A:B,2),\"+AKS177.\",VLOOKUP($K$4,'Цвет мет. опор'!A:B,2,0))","v":"EVL510W.H+AKS177.ANT"},null,"Экран торцевой 800, ЛДСП, с креплением AKS160  ","800х350х18",1540,{"$f":"F35+$F$82","v":4414}]
["Тканевые фронтальные экраны для одиночного стола с креплением AKS166(Комплект кронштейнов для крепления фронтальных надстольных экранов к рабочему столу) "]
[null,"Для удобства клиентов цены изделий указаны вместе с креплением \n(в отгрузочных документах экран и крепление прописываются отдельно)→",null,null,null,"Розничная цена  без крепления, руб.","Розничная цена с креплением, руб."]
[" EVL512",{"$f":"CONCATENATE(A38,\".\",VLOOKUP($I$4,'Цвет ткани'!A:B,2,0),\"+AKS166.\",VLOOKUP($K$4,'Цвет мет. опор'!A:B,2,0))","v":" EVL512.2+AKS166.ANT"},null,"Экран стола 1000, ткань, с креплением AKS166  ","1000х383х22",4841,{"$f":"F38+$F$81","v":6005}]
["EVL501",{"$f":"CONCATENATE(A39,\".\",VLOOKUP($I$4,'Цвет ткани'!A:B,2,0),\"+AKS166.\",VLOOKUP($K$4,'Цвет мет. опор'!A:B,2,0))","v":"EVL501.2+AKS166.ANT"},null,"Экран стола 1200, ткань, с креплением AKS166 ","1200х383х22",5319,{"$f":"F39+$F$81","v":6483}]
["EVL503",{"$f":"CONCATENATE(A40,\".\",VLOOKUP($I$4,'Цвет ткани'!A:B,2,0),\"+AKS166.\",VLOOKUP($K$4,'Цвет мет. опор'!A:B,2,0))","v":"EVL503.2+AKS166.ANT"},null,"Экран стола 1400, ткань, с креплением AKS166","1400х383х22",6819,{"$f":"F40+$F$81","v":7983}]
["EVL505",{"$f":"CONCATENATE(A41,\".\",VLOOKUP($I$4,'Цвет ткани'!A:B,2,0),\"+AKS166.\",VLOOKUP($K$4,'Цвет мет. опор'!A:B,2,0))","v":"EVL505.2+AKS166.ANT"},null,"Экран стола 1600, ткань, с креплением AKS166","1600х383х22",7651,{"$f":"F41+$F$81","v":8815}]
["EVL507",{"$f":"CONCATENATE(A42,\".\",VLOOKUP($I$4,'Цвет ткани'!A:B,2,0),\"+AKS166.\",VLOOKUP($K$4,'Цвет мет. опор'!A:B,2,0))","v":"EVL507.2+AKS166.ANT"},null,"Экран стола 1800, ткань, с креплением AKS166 ","1800х383х22",8666,{"$f":"F42+$F$81","v":9830}]
["Тканевые фронтальные экраны для бенчей  с креплением \nAKS165 (Комплект кронштейнов двойных со штырём для \nкрепления экрана к бенчу)"]
["Для удобства клиентов цены изделий указаны вместе с креплением→ \n(в отгрузочных документах экран и крепление прописываются отдельно)",null,null,null,null,"Розничная цена  без крепления, руб.","Розничная цена с креплением, руб."]
[" EVL512",{"$f":"CONCATENATE(A45,\".\",VLOOKUP($I$4,'Цвет ткани'!A:B,2,0),\"+AKS165.\",VLOOKUP($K$4,'Цвет мет. опор'!A:B,2,0))","v":" EVL512.2+AKS165.ANT"},null,"Экран бенча 1000, ткань, с креплением AKS165","1000х383х22",4841,{"$f":"F45+$F$80","v":6081}]
["EVL501",{"$f":"CONCATENATE(A46,\".\",VLOOKUP($I$4,'Цвет ткани'!A:B,2,0),\"+AKS165.\",VLOOKUP($K$4,'Цвет мет. опор'!A:B,2,0))","v":"EVL501.2+AKS165.ANT"},null,"Экран бенча 1200, ткань, с креплением AKS165","1200х383х22",5319,{"$f":"F46+$F$80","v":6559}]
["EVL503",{"$f":"CONCATENATE(A47,\".\",VLOOKUP($I$4,'Цвет ткани'!A:B,2,0),\"+AKS165.\",VLOOKUP($K$4,'Цвет мет. опор'!A:B,2,0))","v":"EVL503.2+AKS165.ANT"},null,"Экран бенча 1400, ткань, с креплением AKS165","1400х383х22",6819,{"$f":"F47+$F$80","v":8059}]
["EVL505",{"$f":"CONCATENATE(A48,\".\",VLOOKUP($I$4,'Цвет ткани'!A:B,2,0),\"+AKS165.\",VLOOKUP($K$4,'Цвет мет. опор'!A:B,2,0))","v":"EVL505.2+AKS165.ANT"},null,"Экран бенча 1600, ткань, с креплением AKS165","1600х383х22",7651,{"$f":"F48+$F$80","v":8891}]
["EVL507",{"$f":"CONCATENATE(A49,\".\",VLOOKUP($I$4,'Цвет ткани'!A:B,2,0),\"+AKS165.\",VLOOKUP($K$4,'Цвет мет. опор'!A:B,2,0))","v":"EVL507.2+AKS165.ANT"},null,"Экран бенча 1800, ткань, с креплением AKS165","1800х383х22",8666,{"$f":"F49+$F$80","v":9906}]
[null,"Фронтальные экраны ЛДСП с креплением AKS166(Комплект \nкронштейнов для крепления фронтальных надстольных экранов к рабочему столу)"]
["Для удобства клиентов цены изделий указаны вместе с креплением→ \n(в отгрузочных документах экран и крепление прописываются отдельно)",null,null,null,null,"Розничная цена  без крепления, руб.","Розничная цена с креплением, руб."]
[" EVL512W",{"$f":"CONCATENATE(A52,\".\",VLOOKUP($J$4,'Цвет столешницы'!A:B,2),\"+AKS166.\",VLOOKUP($K$4,'Цвет мет. опор'!A:B,2,0))","v":" EVL512W.H+AKS166.ANT"},null,"Экран стола 1000, ЛДСП, с креплением AKS166","1000х383х18",2134,{"$f":"F52+$F$81","v":3298}]
["EVL501W",{"$f":"CONCATENATE(A53,\".\",VLOOKUP($J$4,'Цвет столешницы'!A:B,2),\"+AKS166.\",VLOOKUP($K$4,'Цвет мет. опор'!A:B,2,0))","v":"EVL501W.H+AKS166.ANT"},null,"Экран стола 1200, ЛДСП, с креплением AKS166","1200х383х18",2701,{"$f":"F53+$F$81","v":3865}]
["EVL503W",{"$f":"CONCATENATE(A54,\".\",VLOOKUP($J$4,'Цвет столешницы'!A:B,2),\"+AKS166.\",VLOOKUP($K$4,'Цвет мет. опор'!A:B,2,0))","v":"EVL503W.H+AKS166.ANT"},null,"Экран стола 1400, ЛДСП, с креплением AKS166","1400х383х18",3133,{"$f":"F54+$F$81","v":4297}]
["EVL505W",{"$f":"CONCATENATE(A55,\".\",VLOOKUP($J$4,'Цвет столешницы'!A:B,2),\"+AKS166.\",VLOOKUP($K$4,'Цвет мет. опор'!A:B,2,0))","v":"EVL505W.H+AKS166.ANT"},null,"Экран стола 1600, ЛДСП, с креплением AKS166","1600х383х18",3724,{"$f":"F55+$F$81","v":4888}]
["EVL507W",{"$f":"CONCATENATE(A56,\".\",VLOOKUP($J$4,'Цвет столешницы'!A:B,2),\"+AKS166.\",VLOOKUP($K$4,'Цвет мет. опор'!A:B,2,0))","v":"EVL507W.H+AKS166.ANT"},null,"Экран стола 1800, ЛДСП, с креплением AKS166","1800х383х18",4013,{"$f":"F56+$F$81","v":5177}]
[null,"Фронтальные экраны ЛДСП с креплением AKS165\n(Комплект кронштейнов двойных со штырём \nдля крепления экрана к бенчу)"]
["Для удобства клиентов цены изделий указаны вместе с креплением→ \n(в отгрузочных документах экран и крепление прописываются отдельно)",null,null,null,null,"Розничная цена  без крепления, руб.","Розничная цена с креплением, руб."]
[" EVL512W",{"$f":"CONCATENATE(A59,\".\",VLOOKUP($J$4,'Цвет столешницы'!A:B,2),\"+AKS165.\",VLOOKUP($K$4,'Цвет мет. опор'!A:B,2,0))","v":" EVL512W.H+AKS165.ANT"},null,"Экран бенча 1000, ЛДСП, с креплением AKS165","1000х383х18",2134,{"$f":"F59+$F$80","v":3374}]
["EVL501W",{"$f":"CONCATENATE(A60,\".\",VLOOKUP($J$4,'Цвет столешницы'!A:B,2),\"+AKS165.\",VLOOKUP($K$4,'Цвет мет. опор'!A:B,2,0))","v":"EVL501W.H+AKS165.ANT"},null,"Экран бенча 1200, ЛДСП, с креплением AKS165","1200х383х18",2701,{"$f":"F60+$F$80","v":3941}]
["EVL503W",{"$f":"CONCATENATE(A61,\".\",VLOOKUP($J$4,'Цвет столешницы'!A:B,2),\"+AKS165.\",VLOOKUP($K$4,'Цвет мет. опор'!A:B,2,0))","v":"EVL503W.H+AKS165.ANT"},null,"Экран бенча 1400, ЛДСП, с креплением AKS165","1400х383х18",3133,{"$f":"F61+$F$80","v":4373}]
["EVL505W",{"$f":"CONCATENATE(A62,\".\",VLOOKUP($J$4,'Цвет столешницы'!A:B,2),\"+AKS165.\",VLOOKUP($K$4,'Цвет мет. опор'!A:B,2,0))","v":"EVL505W.H+AKS165.ANT"},null,"Экран бенча 1600, ЛДСП, с креплением AKS165","1600х383х18",3724,{"$f":"F62+$F$80","v":4964}]
["EVL507",{"$f":"CONCATENATE(A63,\".\",VLOOKUP($J$4,'Цвет столешницы'!A:B,2),\"+AKS165.\",VLOOKUP($K$4,'Цвет мет. опор'!A:B,2,0))","v":"EVL507.H+AKS165.ANT"},null,"Экран бенча 1800, ЛДСП, с креплением AKS165","1800х383х18",4013,{"$f":"F63+$F$80","v":5253}]
[null,"Фронтали ЛДСП с креплением AKS168 "]
["Для удобства клиентов цены изделий указаны вместе с креплением→ \n(в отгрузочных документах экран и крепление прописываются отдельно)",null,null,null,null,"Розничная цена  без крепления, руб.","Розничная цена с креплением, руб."]
["EVL139",{"$f":"CONCATENATE(A66,\".\",VLOOKUP($J$4,'Цвет столешницы'!A:B,2),\"+AKS168.\",VLOOKUP($K$4,'Цвет мет. опор'!A:B,2,0))","v":"EVL139.H+AKS168.ANT"},null,"Фронталь скромности стола 1000 мм с креплением AKS168 ","850х365х18",1076,{"$f":"F66+$F$84","v":2117}]
["EVL140",{"$f":"CONCATENATE(A67,\".\",VLOOKUP($J$4,'Цвет столешницы'!A:B,2),\"+AKS168.\",VLOOKUP($K$4,'Цвет мет. опор'!A:B,2,0))","v":"EVL140.H+AKS168.ANT"},null,"Фронталь скромности стола 1200 мм с креплением AKS168 ","1050х365х18",1393,{"$f":"F67+$F$84","v":2434}]
["EVL141",{"$f":"CONCATENATE(A68,\".\",VLOOKUP($J$4,'Цвет столешницы'!A:B,2),\"+AKS168.\",VLOOKUP($K$4,'Цвет мет. опор'!A:B,2,0))","v":"EVL141.H+AKS168.ANT"},null,"Фронталь скромности стола 1400 мм с креплением AKS168 ","1250х365х18",1588,{"$f":"F68+$F$84","v":2629}]
["EVL142",{"$f":"CONCATENATE(A69,\".\",VLOOKUP($J$4,'Цвет столешницы'!A:B,2),\"+AKS168.\",VLOOKUP($K$4,'Цвет мет. опор'!A:B,2,0))","v":"EVL142.H+AKS168.ANT"},null,"Фронталь скромности стола 1600 мм с креплением AKS168 ","1450х365х18",1956,{"$f":"F69+$F$84","v":2997}]
["EVL143",{"$f":"CONCATENATE(A70,\".\",VLOOKUP($J$4,'Цвет столешницы'!A:B,2),\"+AKS168.\",VLOOKUP($K$4,'Цвет мет. опор'!A:B,2,0))","v":"EVL143.H+AKS168.ANT"},null,"Фронталь скромности стола 1800 мм с креплением AKS168 ","1650х365х18",2193,{"$f":"F70+$F$84","v":3234}]
[null,"Вставки для бенчей (комплектуются фурнитурой, которая может быть в белом цвете или в цвете антрацит)"]
[null,null,null,null,null,"Розничная цена, руб."]
["EVL550",{"$f":"CONCATENATE(A73,\".\", VLOOKUP($K$4,'Цвет мет. опор'!A:B,2,FALSE))","v":"EVL550.ANT"},null,"Вставка для бенчей шириной 1000","1000х40х25",1274]
["EVL551",{"$f":"CONCATENATE(A74,\".\", VLOOKUP($K$4,'Цвет мет. опор'!A:B,2,FALSE))","v":"EVL551.ANT"},null,"Вставка для бенчей шириной 1200","1200х40х25",1360]
["EVL552",{"$f":"CONCATENATE(A75,\".\", VLOOKUP($K$4,'Цвет мет. опор'!A:B,2,FALSE))","v":"EVL552.ANT"},null,"Вставка для бенчей шириной 1400","1400х40х25",1476]
["EVL553",{"$f":"CONCATENATE(A76,\".\", VLOOKUP($K$4,'Цвет мет. опор'!A:B,2,FALSE))","v":"EVL553.ANT"},null,"Вставка для бенчей шириной 1600","1600х40х25",1593]
["EVL554",{"$f":"CONCATENATE(A77,\".\", VLOOKUP($K$4,'Цвет мет. опор'!A:B,2,FALSE))","v":"EVL554.ANT"},null,"Вставка для бенчей шириной 1800","1800х40х25",1710]
[null,"Крепеж. Складская программа в цвете Антрацит, под заказ окраска в любой цвет от 10 шт. срок 2 недели."]
[null,null,null,null,null,"Розничная\nцена, руб"]
["AKS165",{"$f":"CONCATENATE(A80,\".\", VLOOKUP($K$4,'Цвет мет. опор'!A:B,2,FALSE),)","v":"AKS165.ANT"},null," Комплект кронштейнов двойных со штырём для крепления экрана (на бенчи)",null,1240]
["AKS166",{"$f":"CONCATENATE(A81,\".\", VLOOKUP($K$4,'Цвет мет. опор'!A:B,2,FALSE),)","v":"AKS166.ANT"},null," Комплект кронштейнов для крепления фронтальных надстольных экранов к рабочему столу",null,1164]
["AKS177",{"$f":"CONCATENATE(A82,\".\", VLOOKUP($K$4,'Цвет мет. опор'!A:B,2,FALSE),)","v":"AKS177.ANT"},null,"Комплект (2 шт.) кронштейнов для торцевых экранов ",null,2874]
["AKS161",{"$f":"CONCATENATE(A83,\".\", VLOOKUP($K$4,'Цвет мет. опор'!A:B,2,FALSE),)","v":"AKS161.ANT"},null,"Кабель канал с креплением к экрану для одиночного стола (для экранов ЛДСП и тканевых)","600х100х100",2723]
["AKS168",{"$f":"CONCATENATE(A84,\".\", VLOOKUP($K$4,'Цвет мет. опор'!A:B,2,FALSE),)","v":"AKS168.ANT"},null,"Комплект держателей для фронтали скромности любого размера","165х35х82\n(каждый)",1041]
[null,"Кабель каналы с креплением к столешнице"]
[null,null,null,null,null,"Розничная\nцена, руб"]
["AKS170",{"$f":"CONCATENATE(A87,\".\", VLOOKUP($K$4,'Цвет мет. опор'!A:B,2,FALSE),)","v":"AKS170.ANT"},null,"Металлические кабель-каналы с креплением к столешнице","1000х90х55h\n(для стола 1,2 м.)",2369]
["AKS171",{"$f":"CONCATENATE(A88,\".\", VLOOKUP($K$4,'Цвет мет. опор'!A:B,2,FALSE),)","v":"AKS171.ANT"},null,null,"1200х90х55h\n(для стола 1,4 м.)",2443]
["AKS172",{"$f":"CONCATENATE(A89,\".\", VLOOKUP($K$4,'Цвет мет. опор'!A:B,2,FALSE),)","v":"AKS172.ANT"},null,null,"1400х90х55h\n(для стола 1,6 м.)",2854]
["AKS173",{"$f":"CONCATENATE(A90,\".\", VLOOKUP($K$4,'Цвет мет. опор'!A:B,2,FALSE),)","v":"AKS173.ANT"},null,null,"1600х90х55h\n(для стола 1,8 м.)",3126]
[]
[null,"Дополнительные аксессуары"]
["TAR080","TAR080.ANT",null,"Крепление для системного блока","220х80х550",2811,{"$f":"ROUND(F93*0.85,0)","v":2389}]
["TAR080","TAR080.Н"]
["TAR091","TAR091.H",null,"Кабель-канал 100 см сетчатый. Белый","1000х120х60",2624,2230]
["TAR092","TAR092.H",null,"Кабель-канал 120 см сетчатый. Белый","1200х120х60",2795,2376]
["TAR093","TAR093.H",null,"Кабель-канал 140 см сетчатый. Белый","1400х120х60",2983,2536]
["AKS125.1","AKS125.1 Черный\nAKS125.1 Белый",null,"Держатель ситемного блока.\nЧерный/Белый","135-245х400х375-525",4529,3850]
["AKS123","AKS123.H",null,"Держатель ситемного блока.\nБелый",null,2325,1976]
[]
[]
[]
[]
[]
[]
[null,"Кодировка АРТИКУЛА экрана: EVL505.ANT"]
[null,"или экран-фронтали",null,null,"или"]
[null,null,"Модель экрана.Код цвета крепления",null,"Код цвета ткани",null,"Код цвета ЛДСП"]
[null,null,null,"H  Белый","Mint","MNT","H","Белый"]
[null,null,"Экраны из ЛДСП после буквенно-цифрового кода имеют \nдоп. символ W","ANT  Антрацит","Ash","ASH","U727 ","Серый Камень"]
[null,null,null,null,"Grey","GREY","R2","Серый"]
[null,null,null,null,"Yellow(заказ) ","YLW","ANT","Антрацит"]
[null,null,null,null,"Denim(заказ) ","DNM","U003","Дуб Честерфилд"]
[null,null,null,null,"Sand(заказ) ","SND","L","Дуб 131"]

{"sheet":"Комп--щие Bench-систем","index":13,"n_rows":184,"n_cols":15,"rows_kept":184,"cut":false,"hidden":true,"merged":[[0,7,0,8],[169,2,173,2],[169,3,173,3],[153,1,153,5]]}
[null,"TARGET EVOLUTION",null,null,null,{"$f":"#REF!","v":{"$error":"#REF!"}},null,"Размер скидки устанавливается на 1-м листе"]
[null,"Опоры для бенч систем и столов"]
[]
["АРТИКУЛ","ИЗДЕЛИЕ","НАИМЕНОВАНИЕ","РАЗМЕР (ДхШхВ),       мм","ЦЕНА","ЦЕНА со Скидкой"]
["EVL001",null,"Набор опор цельносварных крайних 40x40 П700\nАНТРАЦИТ, СЕРЫЕ, БЕЛЫЕ","700х40х715",7325,{"$f":"E5*(100-#REF!)/100","v":{"$error":"#REF!"}},{"$f":"ROUND(VLOOKUP(A5,[3]Лист2!$A:$H,7,FALSE),0)","v":7325},{"$f":"VLOOKUP(A5,[3]Лист2!$A:$H,3,FALSE)","v":"Набор опор цельносварных крайних 40x40 П700"},{"$f":"VLOOKUP(A5,[3]Лист2!$A:$H,1,FALSE)","v":"EVL001"}]
["EVL089",null,"Опора цельносварная крайняя 40x40 П600","600х40х715",3603,{"$f":"E6*(100-#REF!)/100","v":{"$error":"#REF!"}},{"$f":"ROUND(VLOOKUP(A6,[3]Лист2!$A:$H,7,FALSE),0)","v":3603},{"$f":"VLOOKUP(A6,[3]Лист2!$A:$H,3,FALSE)","v":"Опора цельносварная крайняя 40x40 П600"},{"$f":"VLOOKUP(A6,[3]Лист2!$A:$H,1,FALSE)","v":"EVL089"}]
["EVL047",null,"Набор опор цельносварных крайних 40x40 П800","800х40х715",{"$f":"7471/2","v":3735.5},{"$f":"E7*(100-#REF!)/100","v":{"$error":"#REF!"}},{"$f":"ROUND(VLOOKUP(A7,[3]Лист2!$A:$H,7,FALSE),0)","v":7471},{"$f":"VLOOKUP(A7,[3]Лист2!$A:$H,3,FALSE)","v":"Набор опор цельносварных крайних 40x40 П800"},{"$f":"VLOOKUP(A7,[3]Лист2!$A:$H,1,FALSE)","v":"EVL047"},null,"Считаем 1 шт. т.к. в формуле *2"]
["EVL029",null,"Опора цельносварная крайняя 40x40 П900\nАНТРАЦИТ, СЕРАЯ, БЕЛАЯ","900х40х715",3850,{"$f":"E8*(100-#REF!)/100","v":{"$error":"#REF!"}},{"$f":"ROUND(VLOOKUP(A8,[3]Лист2!$A:$H,7,FALSE),0)","v":7115},{"$f":"VLOOKUP(A8,[3]Лист2!$A:$H,3,FALSE)","v":"Набор опор цельносварных крайних 40x40 П600"},{"$f":"VLOOKUP(A8,[3]Лист2!$A:$H,1,FALSE)","v":"EVL029"}]
["EVL",null,"Комплект траверс (40х20) для прямого стола 600","592х40х100",4236,{"$f":"E9*(100-#REF!)/100","v":{"$error":"#REF!"}},{"$f":"ROUND(VLOOKUP(A9,[3]Лист2!$A:$H,7,FALSE),0)","v":{"$error":"#N/A"}},{"$f":"VLOOKUP(A9,[3]Лист2!$A:$H,3,FALSE)","v":{"$error":"#N/A"}},{"$f":"VLOOKUP(A9,[3]Лист2!$A:$H,1,FALSE)","v":{"$error":"#N/A"}},null,4066]
["EVL",null,"Комплект траверс (40х20) для прямого стола 800","792х40х100",4355,{"$f":"E10*(100-#REF!)/100","v":{"$error":"#REF!"}},{"$f":"ROUND(VLOOKUP(A10,[3]Лист2!$A:$H,7,FALSE),0)","v":{"$error":"#N/A"}},{"$f":"VLOOKUP(A10,[3]Лист2!$A:$H,3,FALSE)","v":{"$error":"#N/A"}},{"$f":"VLOOKUP(A10,[3]Лист2!$A:$H,1,FALSE)","v":{"$error":"#N/A"}},null,4236]
["EVL053",null,"Комплект траверс (40х20) для прямого стола 1000","992х40х100",4842,{"$f":"E11*(100-#REF!)/100","v":{"$error":"#REF!"}},{"$f":"ROUND(VLOOKUP(A11,[3]Лист2!$A:$H,7,FALSE),0)","v":4842},{"$f":"VLOOKUP(A11,[3]Лист2!$A:$H,3,FALSE)","v":"Комплект траверс (40х20) для прямого стола 1000"},{"$f":"VLOOKUP(A11,[3]Лист2!$A:$H,1,FALSE)","v":"EVL053"}]
["EVL002",null,"Комплект траверс (40х20) для прямого стола 1200","1192х40х100",5046,{"$f":"E12*(100-#REF!)/100","v":{"$error":"#REF!"}},{"$f":"ROUND(VLOOKUP(A12,[3]Лист2!$A:$H,7,FALSE),0)","v":5046},{"$f":"VLOOKUP(A12,[3]Лист2!$A:$H,3,FALSE)","v":"Комплект траверс (40х20) для прямого стола 1200"},{"$f":"VLOOKUP(A12,[3]Лист2!$A:$H,1,FALSE)","v":"EVL002"}]
["EVL003",null,"Комплект траверс (40х20) для прямого стола 1400","1392х40х100",5221,{"$f":"E13*(100-#REF!)/100","v":{"$error":"#REF!"}},{"$f":"ROUND(VLOOKUP(A13,[3]Лист2!$A:$H,7,FALSE),0)","v":5221},{"$f":"VLOOKUP(A13,[3]Лист2!$A:$H,3,FALSE)","v":"Комплект траверс (40х20) для прямого стола 1400"},{"$f":"VLOOKUP(A13,[3]Лист2!$A:$H,1,FALSE)","v":"EVL003"}]
["EVL004",null,"Комплект траверс (40х20) для прямого стола 1600","1592х40х100",5366,{"$f":"E14*(100-#REF!)/100","v":{"$error":"#REF!"}},{"$f":"ROUND(VLOOKUP(A14,[3]Лист2!$A:$H,7,FALSE),0)","v":5366},{"$f":"VLOOKUP(A14,[3]Лист2!$A:$H,3,FALSE)","v":"Комплект траверс (40х20) для прямого стола 1600"},{"$f":"VLOOKUP(A14,[3]Лист2!$A:$H,1,FALSE)","v":"EVL004"}]
["EVL035",null,"Комплект траверс (40х20) для прямого стола 1800","1792х40х100",5530,{"$f":"E15*(100-#REF!)/100","v":{"$error":"#REF!"}},{"$f":"ROUND(VLOOKUP(A15,[3]Лист2!$A:$H,7,FALSE),0)","v":5530},{"$f":"VLOOKUP(A15,[3]Лист2!$A:$H,3,FALSE)","v":"Комплект траверс (40х20) для прямого стола 1800"},{"$f":"VLOOKUP(A15,[3]Лист2!$A:$H,1,FALSE)","v":"EVL035"}]
["EVL005",null,"Набор опор цельносварных крайних 60x30 П700\nАНТРАЦИТ, СЕРЫЕ, БЕЛЫЕ","700х60х715",7517,{"$f":"E16*(100-#REF!)/100","v":{"$error":"#REF!"}},{"$f":"ROUND(VLOOKUP(A16,[3]Лист2!$A:$H,7,FALSE),0)","v":7517},{"$f":"VLOOKUP(A16,[3]Лист2!$A:$H,3,FALSE)","v":"Набор опор цельносварных крайних 60x30 П700"},{"$f":"VLOOKUP(A16,[3]Лист2!$A:$H,1,FALSE)","v":"EVL005"}]
["EVL092",null,"Опора цельносварная крайняя 60x30 П600\nАНТРАЦИТ, СЕРАЯ, БЕЛАЯ","600х60х715",3642,{"$f":"E17*(100-#REF!)/100","v":{"$error":"#REF!"}},{"$f":"ROUND(VLOOKUP(A17,[3]Лист2!$A:$H,7,FALSE),0)","v":3642},{"$f":"VLOOKUP(A17,[3]Лист2!$A:$H,3,FALSE)","v":"Опора цельносварная крайняя 60x30 П600"},{"$f":"VLOOKUP(A17,[3]Лист2!$A:$H,1,FALSE)","v":"EVL092"}]
["EVL045",null,"Опора цельносварная крайняя 60x30 П800\nАНТРАЦИТ, СЕРАЯ, БЕЛАЯ","800х60х715",{"$f":"7774/2","v":3887},{"$f":"E18*(100-#REF!)/100","v":{"$error":"#REF!"}},{"$f":"ROUND(VLOOKUP(A18,[3]Лист2!$A:$H,7,FALSE),0)","v":7774},{"$f":"VLOOKUP(A18,[3]Лист2!$A:$H,3,FALSE)","v":"Набор опор цельносварных крайних 60x30 П800"},{"$f":"VLOOKUP(A18,[3]Лист2!$A:$H,1,FALSE)","v":"EVL045"}]
[null,null,"Опора цельносварная крайняя 60x30 П900\nАНТРАЦИТ, СЕРАЯ, БЕЛАЯ","900х60х715",3950,{"$f":"E19*(100-#REF!)/100","v":{"$error":"#REF!"}},{"$f":"ROUND(VLOOKUP(A19,[3]Лист2!$A:$H,7,FALSE),0)","v":{"$error":"#N/A"}},{"$f":"VLOOKUP(A19,[3]Лист2!$A:$H,3,FALSE)","v":{"$error":"#N/A"}},{"$f":"VLOOKUP(A19,[3]Лист2!$A:$H,1,FALSE)","v":{"$error":"#N/A"}}]
[null,null,"Комплект траверс (60х30) для прямого стола 600","592х40х100",4066,{"$f":"E20*(100-#REF!)/100","v":{"$error":"#REF!"}},{"$f":"ROUND(VLOOKUP(A20,[3]Лист2!$A:$H,7,FALSE),0)","v":{"$error":"#N/A"}},{"$f":"VLOOKUP(A20,[3]Лист2!$A:$H,3,FALSE)","v":{"$error":"#N/A"}},{"$f":"VLOOKUP(A20,[3]Лист2!$A:$H,1,FALSE)","v":{"$error":"#N/A"}},null,4066]
[null,null,"Комплект траверс (60х30) для прямого стола 800","792х40х100",4236,{"$f":"E21*(100-#REF!)/100","v":{"$error":"#REF!"}},{"$f":"ROUND(VLOOKUP(A21,[3]Лист2!$A:$H,7,FALSE),0)","v":{"$error":"#N/A"}},{"$f":"VLOOKUP(A21,[3]Лист2!$A:$H,3,FALSE)","v":{"$error":"#N/A"}},{"$f":"VLOOKUP(A21,[3]Лист2!$A:$H,1,FALSE)","v":{"$error":"#N/A"}},null,4236]
["EVL054",null,"Комплект траверс (60х30) для прямого стола 1000","992х40х100",4756,{"$f":"E22*(100-#REF!)/100","v":{"$error":"#REF!"}},{"$f":"ROUND(VLOOKUP(A22,[3]Лист2!$A:$H,7,FALSE),0)","v":4756},{"$f":"VLOOKUP(A22,[3]Лист2!$A:$H,3,FALSE)","v":"Комплект траверс (60х30) для прямого стола 1000"},{"$f":"VLOOKUP(A22,[3]Лист2!$A:$H,1,FALSE)","v":"EVL054"}]
["EVL006",null,"Комплект траверс (60х30) для прямого стола 1200","1192х40х100",4958,{"$f":"E23*(100-#REF!)/100","v":{"$error":"#REF!"}},{"$f":"ROUND(VLOOKUP(A23,[3]Лист2!$A:$H,7,FALSE),0)","v":4958},{"$f":"VLOOKUP(A23,[3]Лист2!$A:$H,3,FALSE)","v":"Комплект траверс (60х30) для прямого стола 1200"},{"$f":"VLOOKUP(A23,[3]Лист2!$A:$H,1,FALSE)","v":"EVL006"}]
["EVL007",null,"Комплект траверс (60х30) для прямого стола 1400","1392х40х100",5215,{"$f":"E24*(100-#REF!)/100","v":{"$error":"#REF!"}},{"$f":"ROUND(VLOOKUP(A24,[3]Лист2!$A:$H,7,FALSE),0)","v":5215},{"$f":"VLOOKUP(A24,[3]Лист2!$A:$H,3,FALSE)","v":"Комплект траверс (60х30) для прямого стола 1400"},{"$f":"VLOOKUP(A24,[3]Лист2!$A:$H,1,FALSE)","v":"EVL007"}]
["EVL008",null,"Комплект траверс (60х30) для прямого стола 1600","1592х40х100",5279,{"$f":"E25*(100-#REF!)/100","v":{"$error":"#REF!"}},{"$f":"ROUND(VLOOKUP(A25,[3]Лист2!$A:$H,7,FALSE),0)","v":5279},{"$f":"VLOOKUP(A25,[3]Лист2!$A:$H,3,FALSE)","v":"Комплект траверс (60х30) для прямого стола 1600"},{"$f":"VLOOKUP(A25,[3]Лист2!$A:$H,1,FALSE)","v":"EVL008"}]
["EVL036",null,"Комплект траверс (60х30) для прямого стола 1800","1792х40х100",5423,{"$f":"E26*(100-#REF!)/100","v":{"$error":"#REF!"}},{"$f":"ROUND(VLOOKUP(A26,[3]Лист2!$A:$H,7,FALSE),0)","v":5423},{"$f":"VLOOKUP(A26,[3]Лист2!$A:$H,3,FALSE)","v":"Комплект траверс (60х30) для прямого стола 1800"},{"$f":"VLOOKUP(A26,[3]Лист2!$A:$H,1,FALSE)","v":"EVL036"}]
["EVL028",null,"Опора цельносварная крайняя 60x30 О600","600х60х715",4265,{"$f":"E27*(100-#REF!)/100","v":{"$error":"#REF!"}},{"$f":"ROUND(VLOOKUP(A27,[3]Лист2!$A:$H,7,FALSE),0)","v":4265},{"$f":"VLOOKUP(A27,[3]Лист2!$A:$H,3,FALSE)","v":"Опора цельносварная крайняя 60x30 О600"},{"$f":"VLOOKUP(A27,[3]Лист2!$A:$H,1,FALSE)","v":"EVL028"}]
["EVL009",null,"Опора цельносварная крайняя 60x30 О700","700х60х715",4393,{"$f":"E28*(100-#REF!)/100","v":{"$error":"#REF!"}},{"$f":"ROUND(VLOOKUP(A28,[3]Лист2!$A:$H,7,FALSE),0)","v":4393},{"$f":"VLOOKUP(A28,[3]Лист2!$A:$H,3,FALSE)","v":"Опора цельносварная крайняя 60x30 О700"},{"$f":"VLOOKUP(A28,[3]Лист2!$A:$H,1,FALSE)","v":"EVL009"}]
["EVL046",null,"Опора цельносварная крайняя 60x30 О800","800х60х715",4381,{"$f":"E29*(100-#REF!)/100","v":{"$error":"#REF!"}},{"$f":"ROUND(VLOOKUP(A29,[3]Лист2!$A:$H,7,FALSE),0)","v":4381},{"$f":"VLOOKUP(A29,[3]Лист2!$A:$H,3,FALSE)","v":"Опора цельносварная крайняя 60x30 О800"},{"$f":"VLOOKUP(A29,[3]Лист2!$A:$H,1,FALSE)","v":"EVL046"}]
["EVL035",null,"Опора цельносварная крайняя 60x30 О900","900х60х715",4400,{"$f":"E30*(100-#REF!)/100","v":{"$error":"#REF!"}},{"$f":"ROUND(VLOOKUP(A30,[3]Лист2!$A:$H,7,FALSE),0)","v":5530},{"$f":"VLOOKUP(A30,[3]Лист2!$A:$H,3,FALSE)","v":"Комплект траверс (40х20) для прямого стола 1800"},{"$f":"VLOOKUP(A30,[3]Лист2!$A:$H,1,FALSE)","v":"EVL035"}]
["EVL030",null,"Опора цельносварная крайняя 40x40 О600","600х40х715",3927,{"$f":"E31*(100-#REF!)/100","v":{"$error":"#REF!"}},{"$f":"ROUND(VLOOKUP(A31,[3]Лист2!$A:$H,7,FALSE),0)","v":3927},{"$f":"VLOOKUP(A31,[3]Лист2!$A:$H,3,FALSE)","v":"Опора цельносварная крайняя 40x40 О600"},{"$f":"VLOOKUP(A31,[3]Лист2!$A:$H,1,FALSE)","v":"EVL030"}]
["EVL068",null,"Опора цельносварная крайняя 40x40 О700","700х40х715",4067,{"$f":"E32*(100-#REF!)/100","v":{"$error":"#REF!"}},{"$f":"ROUND(VLOOKUP(A32,[3]Лист2!$A:$H,7,FALSE),0)","v":4067},{"$f":"VLOOKUP(A32,[3]Лист2!$A:$H,3,FALSE)","v":"Опора цельносварная крайняя 40x40 О700"},{"$f":"VLOOKUP(A32,[3]Лист2!$A:$H,1,FALSE)","v":"EVL068"}]
["EVL048",null,"Опора цельносварная крайняя 40x40 О800","800х40х715",4183,{"$f":"E33*(100-#REF!)/100","v":{"$error":"#REF!"}},{"$f":"ROUND(VLOOKUP(A33,[3]Лист2!$A:$H,7,FALSE),0)","v":4183},{"$f":"VLOOKUP(A33,[3]Лист2!$A:$H,3,FALSE)","v":"Опора цельносварная крайняя 40x40 О800"},{"$f":"VLOOKUP(A33,[3]Лист2!$A:$H,1,FALSE)","v":"EVL048"}]
["EVL039",null,"Опора цельносварная крайняя 40x40 О900","900х40х715",4250,{"$f":"E34*(100-#REF!)/100","v":{"$error":"#REF!"}},{"$f":"ROUND(VLOOKUP(A34,[3]Лист2!$A:$H,7,FALSE),0)","v":{"$error":"#N/A"}},{"$f":"VLOOKUP(A34,[3]Лист2!$A:$H,3,FALSE)","v":{"$error":"#N/A"}},{"$f":"VLOOKUP(A34,[3]Лист2!$A:$H,1,FALSE)","v":{"$error":"#N/A"}},null,4176]
["EVL015",null,"Опора цельносварная промежуточная 40x40 П700","700х40х715",5178,{"$f":"E35*(100-#REF!)/100","v":{"$error":"#REF!"}},{"$f":"ROUND(VLOOKUP(A35,[3]Лист2!$A:$H,7,FALSE),0)","v":5267},{"$f":"VLOOKUP(A35,[3]Лист2!$A:$H,3,FALSE)","v":"Опора цельносварная промежуточная 40x40 П700"},{"$f":"VLOOKUP(A35,[3]Лист2!$A:$H,1,FALSE)","v":"EVL015"}]
["EVL017",null,"Опора цельносварная промежуточная 60x30 П700","700х60х715",5471,{"$f":"E36*(100-#REF!)/100","v":{"$error":"#REF!"}},{"$f":"ROUND(VLOOKUP(A36,[3]Лист2!$A:$H,7,FALSE),0)","v":5471},{"$f":"VLOOKUP(A36,[3]Лист2!$A:$H,3,FALSE)","v":"Опора цельносварная промежуточная 60x30 П700"},{"$f":"VLOOKUP(A36,[3]Лист2!$A:$H,1,FALSE)","v":"EVL017"}]
["EVL031",null,"Опора цельносварная промежуточная 40x40 П600","600х40х715",5066,{"$f":"E37*(100-#REF!)/100","v":{"$error":"#REF!"}},{"$f":"ROUND(VLOOKUP(A37,[3]Лист2!$A:$H,7,FALSE),0)","v":5066},{"$f":"VLOOKUP(A37,[3]Лист2!$A:$H,3,FALSE)","v":"Опора цельносварная промежуточная 40x40 П600"},{"$f":"VLOOKUP(A37,[3]Лист2!$A:$H,1,FALSE)","v":"EVL031"}]
["EVL049",null,"Опора цельносварная промежуточная 40x40 П800","800х40х715",5092,{"$f":"E38*(100-#REF!)/100","v":{"$error":"#REF!"}},{"$f":"ROUND(VLOOKUP(A38,[3]Лист2!$A:$H,7,FALSE),0)","v":5092},{"$f":"VLOOKUP(A38,[3]Лист2!$A:$H,3,FALSE)","v":"Опора цельносварная промежуточная 40x40 П800"},{"$f":"VLOOKUP(A38,[3]Лист2!$A:$H,1,FALSE)","v":"EVL049"}]
[null,null,"Опора цельносварная промежуточная 60x30 П600","600х60х715",5343.0857142857139,{"$f":"E39*(100-#REF!)/100","v":{"$error":"#REF!"}},null,{"$f":"VLOOKUP(A39,[3]Лист2!$A:$H,3,FALSE)","v":{"$error":"#N/A"}},{"$f":"VLOOKUP(A39,[3]Лист2!$A:$H,1,FALSE)","v":{"$error":"#N/A"}}]
["EVL051",null,"Опора цельносварная промежуточная 60x30 П800","800х60х715",5343,{"$f":"E40*(100-#REF!)/100","v":{"$error":"#REF!"}},{"$f":"ROUND(VLOOKUP(A40,[3]Лист2!$A:$H,7,FALSE),0)","v":5343},{"$f":"VLOOKUP(A40,[3]Лист2!$A:$H,3,FALSE)","v":"Опора цельносварная промежуточная 60x30 П800"},{"$f":"VLOOKUP(A40,[3]Лист2!$A:$H,1,FALSE)","v":"EVL051"}]
["EVL034",null,"Опора цельносварная промежуточная 60x30 O600","600х60х715",4521,{"$f":"E41*(100-#REF!)/100","v":{"$error":"#REF!"}},{"$f":"ROUND(VLOOKUP(A41,[3]Лист2!$A:$H,7,FALSE),0)","v":4521},{"$f":"VLOOKUP(A41,[3]Лист2!$A:$H,3,FALSE)","v":"Опора цельносварная промежуточная 60x30 О600"},{"$f":"VLOOKUP(A41,[3]Лист2!$A:$H,1,FALSE)","v":"EVL034"}]
["EVL018",null,"Опора цельносварная промежуточная 60x30 O700","700х60х715",4626,{"$f":"E42*(100-#REF!)/100","v":{"$error":"#REF!"}},{"$f":"ROUND(VLOOKUP(A42,[3]Лист2!$A:$H,7,FALSE),0)","v":4626},{"$f":"VLOOKUP(A42,[3]Лист2!$A:$H,3,FALSE)","v":"Опора цельносварная промежуточная 60x30 O700"},{"$f":"VLOOKUP(A42,[3]Лист2!$A:$H,1,FALSE)","v":"EVL018"}]
[null,null,"Опора цельносварная промежуточная 60x30 O800","800х60х715",4381,{"$f":"E43*(100-#REF!)/100","v":{"$error":"#REF!"}},{"$f":"ROUND(VLOOKUP(A43,[3]Лист2!$A:$H,7,FALSE),0)","v":{"$error":"#N/A"}},{"$f":"VLOOKUP(A43,[3]Лист2!$A:$H,3,FALSE)","v":{"$error":"#N/A"}},{"$f":"VLOOKUP(A43,[3]Лист2!$A:$H,1,FALSE)","v":{"$error":"#N/A"}}]
["EVL032",null,"Опора цельносварная промежуточная 40x40 O600","600х60х715",4346,{"$f":"E44*(100-#REF!)/100","v":{"$error":"#REF!"}},{"$f":"ROUND(VLOOKUP(A44,[3]Лист2!$A:$H,7,FALSE),0)","v":4346},{"$f":"VLOOKUP(A44,[3]Лист2!$A:$H,3,FALSE)","v":"Опора цельносварная промежуточная 40x40 О600"},{"$f":"VLOOKUP(A44,[3]Лист2!$A:$H,1,FALSE)","v":"EVL032"}]
["EVL016",null,"Опора цельносварная промежуточная 40x40 O700","700х60х715",6635,{"$f":"#REF!*(100-#REF!)/100","v":{"$error":"#REF!"}},{"$f":"ROUND(VLOOKUP(A45,[3]Лист2!$A:$H,7,FALSE),0)","v":4475},{"$f":"VLOOKUP(A45,[3]Лист2!$A:$H,3,FALSE)","v":"Опора цельносварная промежуточная 40x40 O700"},{"$f":"VLOOKUP(A45,[3]Лист2!$A:$H,1,FALSE)","v":"EVL016"}]
["EVL048",null,"Опора цельносварная промежуточная 40x40 O800","800х60х715",4475,{"$f":"E46*(100-#REF!)/100","v":{"$error":"#REF!"}},{"$f":"ROUND(VLOOKUP(A46,[3]Лист2!$A:$H,7,FALSE),0)","v":4183},{"$f":"VLOOKUP(A46,[3]Лист2!$A:$H,3,FALSE)","v":"Опора цельносварная крайняя 40x40 О800"},{"$f":"VLOOKUP(A46,[3]Лист2!$A:$H,1,FALSE)","v":"EVL048"}]
["EVL037",null,"Опора цельносварная крайняя 40x40 П1236","1236х40х715",4786,{"$f":"E47*(100-#REF!)/100","v":{"$error":"#REF!"}},{"$f":"ROUND(VLOOKUP(A47,[3]Лист2!$A:$H,7,FALSE),0)","v":4786},{"$f":"VLOOKUP(A47,[3]Лист2!$A:$H,3,FALSE)","v":"Опора цельносварная крайняя 40x40 П1236"},{"$f":"VLOOKUP(A47,[3]Лист2!$A:$H,1,FALSE)","v":"EVL037"}]
["EVL019",null,"Опора цельносварная крайняя 40x40 П1436","1436х40х715",4865,{"$f":"E48*(100-#REF!)/100","v":{"$error":"#REF!"}},{"$f":"ROUND(VLOOKUP(A48,[3]Лист2!$A:$H,7,FALSE),0)","v":4865},{"$f":"VLOOKUP(A48,[3]Лист2!$A:$H,3,FALSE)","v":"Опора цельносварная крайняя 40x40 П1436"},{"$f":"VLOOKUP(A48,[3]Лист2!$A:$H,1,FALSE)","v":"EVL019"}]
["EVL209",null,"Опора цельносварная крайняя 40x40 П1636","1636х40х715",5165,{"$f":"E49*(100-#REF!)/100","v":{"$error":"#REF!"}},{"$f":"ROUND(VLOOKUP(A49,[3]Лист2!$A:$H,7,FALSE),0)","v":5165},{"$f":"VLOOKUP(A49,[3]Лист2!$A:$H,3,FALSE)","v":"Опора цельносварная крайняя 40x40 П1636"},{"$f":"VLOOKUP(A49,[3]Лист2!$A:$H,1,FALSE)","v":"EVL209"}]
["EVL020",null,"Опора цельносварная крайняя 60x30 П1436","1436х60х715",4999,{"$f":"E50*(100-#REF!)/100","v":{"$error":"#REF!"}},{"$f":"ROUND(VLOOKUP(A50,[3]Лист2!$A:$H,7,FALSE),0)","v":4999},{"$f":"VLOOKUP(A50,[3]Лист2!$A:$H,3,FALSE)","v":"Опора цельносварная крайняя 60x30 П1436"},{"$f":"VLOOKUP(A50,[3]Лист2!$A:$H,1,FALSE)","v":"EVL020"}]
["EVL051",null,"Опора цельносварная крайняя 40x40 O1236","1236х40х715",5650,{"$f":"E51*(100-#REF!)/100","v":{"$error":"#REF!"}},{"$f":"ROUND(VLOOKUP(A51,[3]Лист2!$A:$H,7,FALSE),0)","v":5343},{"$f":"VLOOKUP(A51,[3]Лист2!$A:$H,3,FALSE)","v":"Опора цельносварная промежуточная 60x30 П800"},{"$f":"VLOOKUP(A51,[3]Лист2!$A:$H,1,FALSE)","v":"EVL051"}]
["EVL021",null,"Опора цельносварная крайняя 40x40 O1436","1436х40х715",6008,{"$f":"E52*(100-#REF!)/100","v":{"$error":"#REF!"}},{"$f":"ROUND(VLOOKUP(A52,[3]Лист2!$A:$H,7,FALSE),0)","v":6008},{"$f":"VLOOKUP(A52,[3]Лист2!$A:$H,3,FALSE)","v":"Опора цельносварная крайняя 40x40 O1436"},{"$f":"VLOOKUP(A52,[3]Лист2!$A:$H,1,FALSE)","v":"EVL021"}]
["EVL052",null,"Опора цельносварная крайняя 40x40 O1636","1636х40х715",6200,{"$f":"E53*(100-#REF!)/100","v":{"$error":"#REF!"}},{"$f":"ROUND(VLOOKUP(A53,[3]Лист2!$A:$H,7,FALSE),0)","v":{"$error":"#N/A"}},{"$f":"VLOOKUP(A53,[3]Лист2!$A:$H,3,FALSE)","v":{"$error":"#N/A"}},{"$f":"VLOOKUP(A53,[3]Лист2!$A:$H,1,FALSE)","v":{"$error":"#N/A"}}]
["EVL040",null,"Опора цельносварная крайняя 60x30 O1236","1236х60х715",5996,{"$f":"E54*(100-#REF!)/100","v":{"$error":"#REF!"}},{"$f":"ROUND(VLOOKUP(A54,[3]Лист2!$A:$H,7,FALSE),0)","v":5996},{"$f":"VLOOKUP(A54,[3]Лист2!$A:$H,3,FALSE)","v":"Опора цельносварная крайняя 60x30 O1236"},{"$f":"VLOOKUP(A54,[3]Лист2!$A:$H,1,FALSE)","v":"EVL040"}]
["EVL022",null,"Опора цельносварная крайняя 60x30 O1436","1436х60х715",5955,{"$f":"E55*(100-#REF!)/100","v":{"$error":"#REF!"}},{"$f":"ROUND(VLOOKUP(A55,[3]Лист2!$A:$H,7,FALSE),0)","v":5955},{"$f":"VLOOKUP(A55,[3]Лист2!$A:$H,3,FALSE)","v":"Опора цельносварная крайняя 60x30 O1436"},{"$f":"VLOOKUP(A55,[3]Лист2!$A:$H,1,FALSE)","v":"EVL022"}]
["EVL054",null,"Опора цельносварная крайняя 60x30 O1636","1636х60х715",6420,{"$f":"E56*(100-#REF!)/100","v":{"$error":"#REF!"}},{"$f":"ROUND(VLOOKUP(A56,[3]Лист2!$A:$H,7,FALSE),0)","v":4756},{"$f":"VLOOKUP(A56,[3]Лист2!$A:$H,3,FALSE)","v":"Комплект траверс (60х30) для прямого стола 1000"},{"$f":"VLOOKUP(A56,[3]Лист2!$A:$H,1,FALSE)","v":"EVL054"}]
["EVL041",null,"Опора цельносварная промежуточная 40x40 П1236","1236х40х715",6952,{"$f":"E57*(100-#REF!)/100","v":{"$error":"#REF!"}},{"$f":"ROUND(VLOOKUP(A57,[3]Лист2!$A:$H,7,FALSE),0)","v":6952},{"$f":"VLOOKUP(A57,[3]Лист2!$A:$H,3,FALSE)","v":"Опора цельносварная промежуточная 40x40 П1236"},{"$f":"VLOOKUP(A57,[3]Лист2!$A:$H,1,FALSE)","v":"EVL041"}]
["EVL023",null,"Опора цельносварная промежуточная 40x40 П1436","1436х40х715",7030,{"$f":"E58*(100-#REF!)/100","v":{"$error":"#REF!"}},{"$f":"ROUND(VLOOKUP(A58,[3]Лист2!$A:$H,7,FALSE),0)","v":7030},{"$f":"VLOOKUP(A58,[3]Лист2!$A:$H,3,FALSE)","v":"Опора цельносварная промежуточная 40x40 П1436"},{"$f":"VLOOKUP(A58,[3]Лист2!$A:$H,1,FALSE)","v":"EVL023"}]
["EVL210",null,"Опора цельносварная промежуточная 40x40 П1636","1636х40х715",6987,{"$f":"E59*(100-#REF!)/100","v":{"$error":"#REF!"}},{"$f":"ROUND(VLOOKUP(A59,[3]Лист2!$A:$H,7,FALSE),0)","v":6987},{"$f":"VLOOKUP(A59,[3]Лист2!$A:$H,3,FALSE)","v":"Опора цельносварная промежуточная 40x40 П1636"},{"$f":"VLOOKUP(A59,[3]Лист2!$A:$H,1,FALSE)","v":"EVL210"}]
["EVL024",null,"Опора цельносварная промежуточная 60x30 П1436","1436х60х715",7269,{"$f":"E60*(100-#REF!)/100","v":{"$error":"#REF!"}},{"$f":"ROUND(VLOOKUP(A60,[3]Лист2!$A:$H,7,FALSE),0)","v":7269},{"$f":"VLOOKUP(A60,[3]Лист2!$A:$H,3,FALSE)","v":"Опора цельносварная промежуточная 60x30 П1436"},{"$f":"VLOOKUP(A60,[3]Лист2!$A:$H,1,FALSE)","v":"EVL024"}]
["EVL057",null,"Опора цельносварная промежуточная 40x40 O1236","1236х40х715",5800,{"$f":"E61*(100-#REF!)/100","v":{"$error":"#REF!"}},{"$f":"ROUND(VLOOKUP(A61,[3]Лист2!$A:$H,7,FALSE),0)","v":{"$error":"#N/A"}},{"$f":"VLOOKUP(A61,[3]Лист2!$A:$H,3,FALSE)","v":{"$error":"#N/A"}},{"$f":"VLOOKUP(A61,[3]Лист2!$A:$H,1,FALSE)","v":{"$error":"#N/A"}},null,5576]
["EVL025",null,"Опора цельносварная промежуточная 40x40 O1436","1436х40х715",6010,{"$f":"E62*(100-#REF!)/100","v":{"$error":"#REF!"}},{"$f":"ROUND(VLOOKUP(A62,[3]Лист2!$A:$H,7,FALSE),0)","v":6010},{"$f":"VLOOKUP(A62,[3]Лист2!$A:$H,3,FALSE)","v":"Опора цельносварная промежуточная 40x40 O1436"},{"$f":"VLOOKUP(A62,[3]Лист2!$A:$H,1,FALSE)","v":"EVL025"}]
["EVL058",null,"Опора цельносварная промежуточная 40x40 O1636","1636х40х715",5999,{"$f":"E63*(100-#REF!)/100","v":{"$error":"#REF!"}},{"$f":"ROUND(VLOOKUP(A63,[3]Лист2!$A:$H,7,FALSE),0)","v":{"$error":"#N/A"}},{"$f":"VLOOKUP(A63,[3]Лист2!$A:$H,3,FALSE)","v":{"$error":"#N/A"}},{"$f":"VLOOKUP(A63,[3]Лист2!$A:$H,1,FALSE)","v":{"$error":"#N/A"}},null,5999]
["EVL044",null,"Опора цельносварная промежуточная 60x30 O1236","1236х60х715",5996,{"$f":"E64*(100-#REF!)/100","v":{"$error":"#REF!"}},{"$f":"ROUND(VLOOKUP(A64,[3]Лист2!$A:$H,7,FALSE),0)","v":5996},{"$f":"VLOOKUP(A64,[3]Лист2!$A:$H,3,FALSE)","v":"Опора цельносварная промежуточная 60x30 O1236"},{"$f":"VLOOKUP(A64,[3]Лист2!$A:$H,1,FALSE)","v":"EVL044"}]
["EVL026",null,"Опора цельносварная промежуточная 60x30 O1436","1436х60х715",6249,{"$f":"E65*(100-#REF!)/100","v":{"$error":"#REF!"}},{"$f":"ROUND(VLOOKUP(A65,[3]Лист2!$A:$H,7,FALSE),0)","v":6249},{"$f":"VLOOKUP(A65,[3]Лист2!$A:$H,3,FALSE)","v":"Опора цельносварная промежуточная 60x30 O1436"}]
["EVL212",null,"Опора цельносварная промежуточная 60x30 O1636","1636х60х715",7655,{"$f":"E66*(100-#REF!)/100","v":{"$error":"#REF!"}},"из Почты от Татьяны",{"$f":"VLOOKUP(A66,[3]Лист2!$A:$H,3,FALSE)","v":{"$error":"#N/A"}},null,null,5999]
["EVL209",null,"Опора цельносварная крайняя 40x40 П1636","1636х40х715",5165,{"$f":"E67*(100-#REF!)/100","v":{"$error":"#REF!"}},{"$f":"ROUND(VLOOKUP(A67,[3]Лист2!$A:$H,7,FALSE),0)","v":5165},{"$f":"VLOOKUP(A67,[3]Лист2!$A:$H,3,FALSE)","v":"Опора цельносварная крайняя 40x40 П1636"}]
["EVL038",null,"Опора цельносварная крайняя 60x30 П1236","1236х60х715",4921,{"$f":"E68*(100-#REF!)/100","v":{"$error":"#REF!"}},{"$f":"ROUND(VLOOKUP(A68,[3]Лист2!$A:$H,7,FALSE),0)","v":4921},{"$f":"VLOOKUP(A68,[3]Лист2!$A:$H,3,FALSE)","v":"Опора цельносварная крайняя 60x30 П1236"}]
["EVL205",null,"Опора цельносварная крайняя 60x30 П1636","1636х60х715",5381,{"$f":"E69*(100-#REF!)/100","v":{"$error":"#REF!"}},{"$f":"ROUND(VLOOKUP(A69,[3]Лист2!$A:$H,7,FALSE),0)","v":5381},{"$f":"VLOOKUP(A69,[3]Лист2!$A:$H,3,FALSE)","v":"Опора цельносварная крайняя 60x30 П1636"}]
["EVL042",null,"Опора цельносварная промежуточная 60x30 П1236","1236х60х715",7191,{"$f":"E70*(100-#REF!)/100","v":{"$error":"#REF!"}},{"$f":"ROUND(VLOOKUP(A70,[3]Лист2!$A:$H,7,FALSE),0)","v":7191},{"$f":"VLOOKUP(A70,[3]Лист2!$A:$H,3,FALSE)","v":"Опора цельносварная промежуточная 60x30 П1236"}]
["EVL208",null,"Опора цельносварная промежуточная 60x30 П1636","1636х40х715",7648,{"$f":"E71*(100-#REF!)/100","v":{"$error":"#REF!"}},{"$f":"ROUND(VLOOKUP(A71,[3]Лист2!$A:$H,7,FALSE),0)","v":7648},{"$f":"VLOOKUP(A71,[3]Лист2!$A:$H,3,FALSE)","v":"Опора цельносварная промежуточная 60x30 П1636"}]
[null,null,"Траверса для приставки 1000 мм 60х30"]
["ЛДСП: толщина столешницы 25 мм, цвета: Белый, Rovere, Венге, Салтило, Серый, Орех Гварнери, Антрацит, Честерфильд, Мокко(под заказ 2 нед). Заглушка в столешнице белая или антрацит, рекомендуем выбирать под цвет опор."]
[null,"Столешницы для столов и бенчей"]
[null,null,null,"Столешница 800х700","800х700х25",3678,{"$f":"F75*(100-#REF!)/100","v":{"$error":"#REF!"}}]
[null,null,null,"Столешница 1000х700","1000х700х25",4513.3142857142848,{"$f":"F76*(100-#REF!)/100","v":{"$error":"#REF!"}},"Столешница 1000х700","1000х700х25",4188,"PACK1EVL100.SLT",3969.8857142857137,543.42857142857133,{"$f":"SUM(L76:M76)","v":4513.3142857142848}]
["EVL201",null,null,"Столешница 1200х700","1200х700х25",5095.2571428571428,{"$f":"F77*(100-#REF!)/100","v":{"$error":"#REF!"}},"Столешница 1200х700","1200х700х25",5151,"PACK1EVL101.U2108",4551.8285714285712,543.42857142857133,{"$f":"SUM(L77:M77)","v":5095.2571428571428}]
["EVL202",null,null,"Столешница 1400х700","1400х700х25",5610.2857142857147,{"$f":"F78*(100-#REF!)/100","v":{"$error":"#REF!"}},"Столешница 1400х700","1400х700х25",5741,"PACK1EVL102.U2108",5066.8571428571431,543.42857142857133,5610.2857142857147]
["EVL203",null,null,"Столешница 1600х700","1600х700х25",6047.4285714285716,{"$f":"F79*(100-#REF!)/100","v":{"$error":"#REF!"}},"Столешница 1600х700","1600х700х25",6330,"PACK1EVL103.SLT",5504,543.42857142857133,6047.4285714285716]
[null,null,null,"Столешница 1800х700","1800х700х25",6582.3428571428567,{"$f":"F80*(100-#REF!)/100","v":{"$error":"#REF!"}},"Столешница 1800х700","1800х700х25",6731,"PACK1EVL104.SLT",6038.9142857142851,543.42857142857133,6582.3428571428567]
[null,null,null,"Столешница 600х600","600х600х25","нет цены",{"$f":"F81*(100-#REF!)/100","v":{"$error":"#VALUE!"}},null,null,null,null,null,null,"нет цены",2500]
[null,null,null,"Столешница 700х600","800х600х25","нет цены",{"$f":"F82*(100-#REF!)/100","v":{"$error":"#VALUE!"}},null,null,null,null,null,null,"нет цены",3332]
[null,null,null,"Столешница 1000х600","1000х600х25",4039.3428571428567,{"$f":"F83*(100-#REF!)/100","v":{"$error":"#REF!"}},"Столешница 1000х600","1000х600х25",4166,"PACK1EVL113.U003",3495.9142857142851,543.42857142857133,4039.3428571428567]
[null,null,null,"Столешница 1200х600","1200х600х25",4510.2285714285717,{"$f":"F84*(100-#REF!)/100","v":{"$error":"#REF!"}},"Столешница 1200х600","1200х600х25",4467,"PACK1EVL114.SLT",3966.8,543.42857142857133,4510.2285714285717]
[null,null,null,"Столешница 1400х600","1400х600х25",4766.8571428571431,{"$f":"F85*(100-#REF!)/100","v":{"$error":"#REF!"}},"Столешница 1400х600","1400х600х25",5020,"PACK1EVL115.SLT",4223.4285714285716,543.42857142857133,4766.8571428571431]
[null,null,null,"Столешница 1600х600","1600х600х25",5419.6857142857143,{"$f":"F86*(100-#REF!)/100","v":{"$error":"#REF!"}},"Столешница 1600х600","1600х600х25",5608,"PACK1EVL116.SLT /4",4876.2571428571428,543.42857142857133,5419.6857142857143]
[null,null,null,"Столешница 1800х600","1800х600х25",6028,{"$f":"F87*(100-#REF!)/100","v":{"$error":"#REF!"}},"Столешница 1800х600","1800х600х25",6308,null,5485,543.42857142857133,6028.4285714285716,6308]
[null,null,null,"Столешница 1000х800","1000х800х25",4545,{"$f":"F88*(100-#REF!)/100","v":{"$error":"#REF!"}},"Столешница 1000х800","1000х800х25",4685,null,4002,543.42857142857133,4545.4285714285716,4685]
[null,null,null,"Столешница 1200х800","1200х800х25",5345,{"$f":"F89*(100-#REF!)/100","v":{"$error":"#REF!"}},"Столешница 1200х800","1200х800х25",5125,"PACK1EVL118.U003",4801.5714285714284,543.42857142857133,5345]
[null,null,null,"Столешница 1400х800","1400х800х25",5971.0857142857149,{"$f":"F90*(100-#REF!)/100","v":{"$error":"#REF!"}},"Столешница 1400х800","1400х800х25",5787,"PACK1EVL119.L",5427.6571428571433,543.42857142857133,5971.0857142857149]
[null,null,null,"Столешница 1600х800","1600х800х25",6511.7142857142853,{"$f":"F91*(100-#REF!)/100","v":{"$error":"#REF!"}},"Столешница 1600х800","1600х800х25",6431,"PACK1EVL120.SLT",5968.2857142857138,543.42857142857133,6511.7142857142853]
[null,null,null,"Столешница 1800х800","1800х800х25",7163.6,{"$f":"F92*(100-#REF!)/100","v":{"$error":"#REF!"}},"Столешница 1800х800","1800х800х25",7456,"PACK1EVL163.SLT",6620.1714285714288,543.42857142857133,7163.6]
["EVL205DX",null,null,"Столешница угловая правая 1200х900","1200х900/700х25",5119,{"$f":"F93*(100-#REF!)/100","v":{"$error":"#REF!"}},"Столешница 1800х900","1800х900х25",null,null,4575.2285714285708,543.42857142857133,5118.6571428571424,6026]
["EVL205SX",null,null,"Столешница угловая левая 1200х900","1200х900/700х25",5119,{"$f":"F94*(100-#REF!)/100","v":{"$error":"#REF!"}},"Столешница угловая правая 1200х900","1200х900/700х25",6026,"PACK1EVL105DX.SLT",4575.2285714285708,543.42857142857133,5118.6571428571424]
["EVL206DX",null,null,"Столешница угловая правая 1400х900","1400х900/700х25",5922.1714285714279,{"$f":"F95*(100-#REF!)/100","v":{"$error":"#REF!"}},"Столешница угловая правая 1400х900","1400х900/700х25",6750,"PACK1EVL106SX.U003",5378.7428571428563,543.42857142857133,5922.1714285714279]
["EVL206SX",null,null,"Столешница угловая левая 1400х900","1400х900/700х25",5922.1714285714279,{"$f":"F96*(100-#REF!)/100","v":{"$error":"#REF!"}},"Столешница угловая левая 1400х900","1400х900/700х25",6750,"PACK1EVL106SX.U003",5378.7428571428563,543.42857142857133,5922.1714285714279]
["EVL207DX",null,null,"Столешница угловая правая 1600х900","1600х900/700х25",6411,{"$f":"F97*(100-#REF!)/100","v":{"$error":"#REF!"}},"Столешница угловая правая 1600х900","1600х900/700х25",7496,"PACK1EVL107SX.SLT",5868,543.42857142857133,6411.4285714285716]
["EVL207SX",null,null,"Столешница угловая левая 1600х900","1600х900/700х25",6411,{"$f":"F98*(100-#REF!)/100","v":{"$error":"#REF!"}},"Столешница угловая левая 1600х900","1600х900/700х25",7496,null,5868,543.42857142857133,6411.4285714285716,7496]
["EVL209DX",null,null,"Столешница эргономичная правая 1200х900","1200х900/700х25",5098.0857142857139,{"$f":"F99*(100-#REF!)/100","v":{"$error":"#REF!"}},"Столешница эргономичная правая 1200х900","1200х900/700х25",5993,"PACK1EVL109DX.SLT",4554.6571428571424,543.42857142857133,5098.0857142857139]
["EVL209SX",null,null,"Столешница эргономичная левая 1200х900","1200х900/700х25",5098.0857142857139,{"$f":"F100*(100-#REF!)/100","v":{"$error":"#REF!"}},"Столешница эргономичная левая 1200х900","1200х900/700х25",5993,"PACK1EVL109SX.SLT",4554.6571428571424,543.42857142857133,5098.0857142857139]
["EVL210DX",null,null,"Столешница эргономичная правая 1400х900","1400х900/700х25",5735,{"$f":"F101*(100-#REF!)/100","v":{"$error":"#REF!"}},"Столешница эргономичная правая 1400х900","1400х900/700х25",6717,"PACK1EVL110DX.SLT",5191.5714285714284,543.42857142857133,5735]
["EVL210SX",null,null,"Столешница эргономичная левая 1400х900","1400х900/700х25",5735,{"$f":"F102*(100-#REF!)/100","v":{"$error":"#REF!"}},"Столешница эргономичная левая 1400х900","1400х900/700х25",6717,"PACK1EVL110SX.SLT",5191.5714285714284,543.42857142857133,5735]
["EVL211DX",null,null,"Столешница эргономичная правая 1600х900","1600х900/700х25",6388.5714285714284,{"$f":"F103*(100-#REF!)/100","v":{"$error":"#REF!"}},"Столешница эргономичная правая 1600х900","1600х900/700х25",7457,"PACK1EVL111DX.SLT",5845.1428571428569,543.42857142857133,6388.5714285714284]
["EVL211SX",null,null,"Столешница эргономичная левая 1600х900","1600х900/700х25",6388.5714285714284,{"$f":"F104*(100-#REF!)/100","v":{"$error":"#REF!"}},"Столешница эргономичная левая 1600х900","1600х900/700х25",7457,"PACK1EVL111SX.SLT",5845.1428571428569,543.42857142857133,6388.5714285714284]
[null,null,null,"Столешница угловая правая 1200х900","1200х900/600х25",5647.3428571428567,{"$f":"F105*(100-#REF!)/100","v":{"$error":"#REF!"}},"Столешница угловая правая 1200х900","1200х900/600х25",5673,"PACK1EVL123SX.SLT",5103.9142857142851,543.42857142857133,5647.3428571428567]
[null,null,null,"Столешница угловая левая 1200х900","1200х900/600х25",5647.3428571428567,{"$f":"F106*(100-#REF!)/100","v":{"$error":"#REF!"}},"Столешница угловая левая 1200х900","1200х900/600х25",5673,"PACK1EVL123SX.SLT",5103.9142857142851,543.42857142857133,5647.3428571428567]
[null,null,null,"Столешница угловая правая 1400х900","1400х900/600х25",6328.4285714285716,{"$f":"F107*(100-#REF!)/100","v":{"$error":"#REF!"}},"Столешница угловая правая 1400х900","1400х900/600х25",6398,124,5785,543.42857142857133,6328.4285714285716,6398]
[null,null,null,"Столешница угловая левая 1400х900","1400х900/600х25",6328.4285714285716,{"$f":"F108*(100-#REF!)/100","v":{"$error":"#REF!"}},"Столешница угловая левая 1400х900","1400х900/600х25",6398,null,5785,543.42857142857133,6328.4285714285716,6398]
[null,null,null,"Столешница угловая правая 1600х900","1600х900/600х25",6828.4285714285716,{"$f":"F109*(100-#REF!)/100","v":{"$error":"#REF!"}},"Столешница угловая правая 1600х900","1600х900/600х25",7143,null,6285,543.42857142857133,6828.4285714285716,7143]
[null,null,null,"Столешница угловая левая 1600х900","1600х900/600х25",6828.4285714285716,{"$f":"F110*(100-#REF!)/100","v":{"$error":"#REF!"}},"Столешница угловая левая 1600х900","1600х900/600х25",7143,null,6285,543.42857142857133,6828.4285714285716,7143]
[null,null,null,"Столешница угловая правая 1200х900","1200х900/800х25",5778.4285714285716,{"$f":"F111*(100-#REF!)/100","v":{"$error":"#REF!"}},"Столешница угловая правая 1200х900","1200х900/800х25",5673,125,5235,543.42857142857133,5778.4285714285716,5673]
[null,null,null,"Столешница угловая левая 1200х900","1200х900/800х25",5778.4285714285716,{"$f":"F112*(100-#REF!)/100","v":{"$error":"#REF!"}},"Столешница угловая левая 1200х900","1200х900/800х25",5673,125,5235,543.42857142857133,5778.4285714285716,5673]
[null,null,null,"Столешница угловая правая 1400х900","1400х900/800х25",6438.4285714285716,{"$f":"F113*(100-#REF!)/100","v":{"$error":"#REF!"}},"Столешница угловая правая 1400х900","1400х900/800х25",6398,125,5895,543.42857142857133,6438.4285714285716,6398]
[null,null,null,"Столешница угловая левая 1400х900","1400х900/800х25",6438.4285714285716,{"$f":"F114*(100-#REF!)/100","v":{"$error":"#REF!"}},"Столешница угловая левая 1400х900","1400х900/800х25",6398,null,5895,543.42857142857133,6438.4285714285716,6398]
[null,null,null,"Столешница угловая правая 1600х900","1600х900/800х25",6926.2857142857138,{"$f":"F115*(100-#REF!)/100","v":{"$error":"#REF!"}},"Столешница угловая правая 1600х900","1600х900/800х25",7143,"PACK1EVL126DX.U003",6382.8571428571422,543.42857142857133,6926.2857142857138]
[null,null,null,"Столешница угловая левая 1600х900","1600х900/800х25",6926.2857142857138,{"$f":"F116*(100-#REF!)/100","v":{"$error":"#REF!"}},"Столешница угловая левая 1600х900","1600х900/800х25",7143,null,6382.8571428571422,543.42857142857133,6926.2857142857138,7143]
[null,null,null,"Столешница эргономичная угловая\n  левая/правая 1600х1300","1600х1300/700x700",8682,{"$f":"F117*(100-#REF!)/100","v":{"$error":"#REF!"}},"Столешница эргономичная угловая\n  левая/правая 1600х1300","1600х1300/700x700",8682,null,null,543.42857142857133,"нет цены",8682]
[null,null,null,"Столешница эргономичная угловая\n 1400х1200","1400х1200/700",7986.2857142857138,{"$f":"F118*(100-#REF!)/100","v":{"$error":"#REF!"}},"Столешница эргономичная угловая\n 1400х1200","1400х1200/700",7596,"PACK1EVL129SX.U003",7442.8571428571422,543.42857142857133,7986.2857142857138]
[null,null,null,"Столешница эргономичная угловая\n 1400х1200","1400х1200/600x600",7596,{"$f":"F119*(100-#REF!)/100","v":{"$error":"#REF!"}},"Столешница эргономичная угловая\n 1400х1200","1400х1200/600x600",7596,null,null,543.42857142857133,"нет цены",7596]
[null,null,null,"Столешница эргономичная угловая\n 1600х1200","1600х1200/600x600",8268,{"$f":"F120*(100-#REF!)/100","v":{"$error":"#REF!"}},"Столешница эргономичная угловая\n 1600х1200","1600х1200/600x600",8682,null,null,543.42857142857133,"нет цены",8682]
[null,null,null,"Столешница эргономичная угловая\n 1400х1200","1400х1200/700x600",7796,{"$f":"F121*(100-#REF!)/100","v":{"$error":"#REF!"}},"Столешница эргономичная угловая\n 1400х1200","1400х1200/700x600",7596,null,null,543.42857142857133,"нет цены",7596]
[null,null,null,"Столешница эргономичная угловая\n 1600х1200","1600х1200/700x600",8461.2571428571409,{"$f":"F122*(100-#REF!)/100","v":{"$error":"#REF!"}},"Столешница эргономичная угловая\n 1600х1200","1600х1200/700x600",8682,"PACK1EVL130DX.U003",7917.8285714285694,543.42857142857133,8461.2571428571409]
[null,null,null,"Столешница эргономичная угловая\n 1400х1200","1400х1200/800x600",7896,{"$f":"F123*(100-#REF!)/100","v":{"$error":"#REF!"}},"Столешница эргономичная угловая\n 1400х1200","1400х1200/800x600",7596,null,null,543.42857142857133,"нет цены",7596]
[null,null,null,"Столешница эргономичная угловая\n 1600х1200","1600х1200/800x600",8493,{"$f":"F124*(100-#REF!)/100","v":{"$error":"#REF!"}},"Столешница эргономичная угловая\n 1600х1200","1600х1200/800x600",8682,"PACK1EVL132DX.U003",7949.5714285714284,543.42857142857133,8493]
[null,null,null,"Столешница эргономичная угловая\n 1200х1200","1200х1200/600x600",6870,{"$f":"F125*(100-#REF!)/100","v":{"$error":"#REF!"}},"Столешница эргономичная угловая\n 1200х1200","1200х1200/600x600",6870,null,null,543.42857142857133,"нет цены",6870]
[null,null,null,"Столешница эргономичная угловая\n 1200х1200","1200х1200/700x600",6930,{"$f":"F126*(100-#REF!)/100","v":{"$error":"#REF!"}},"Столешница эргономичная угловая\n 1200х1200","1200х1200/700x600",6870,null,null,543.42857142857133,"нет цены",6870]
[null,null,null,"Столешница эргономичная угловая\n 1200х1200","1200х1200/800x600",6970,{"$f":"F127*(100-#REF!)/100","v":{"$error":"#REF!"}},"Столешница эргономичная угловая\n 1200х1200","1200х1200/800x600",6870,null,null,543.42857142857133,"нет цены",6870]
["без лючка, \nдля стола \nпереговоров",null,null,"Столешница прямоугольная 1000х1200","1000х1236х25",8333,{"$f":"F128*(100-#REF!)/100","v":{"$error":"#REF!"}}]
["без лючка, \nдля стола \nпереговоров",null,null,"Столешница прямоугольная 1200х1200","1200х1236х25",9053,{"$f":"F129*(100-#REF!)/100","v":{"$error":"#REF!"}}]
["без лючка, \nдля стола \nпереговоров",null,null,"Столешница прямоугольная 1400х1200","1400х1236х25",10042,{"$f":"F130*(100-#REF!)/100","v":{"$error":"#REF!"}}]
["без лючка, \nдля стола \nпереговоров",null,null,"Столешница прямоугольная 1600х1200","1600х1236х25",11476,{"$f":"F131*(100-#REF!)/100","v":{"$error":"#REF!"}}]
["без лючка, \nдля стола \nпереговоров",null,null,"Столешница прямоугольная 1800х1200","1800х1236х25",12910,{"$f":"F132*(100-#REF!)/100","v":{"$error":"#REF!"}}]
["без лючка, \nдля стола \nпереговоров",null,null,"Столешница прямоугольная 1800х900","1800х900х25",8387,{"$f":"F133*(100-#REF!)/100","v":{"$error":"#REF!"}}]
["без лючка, \nдля стола \nпереговоров",null,null,"Столешница прямоугольная 1200х1400","1200х1436х25",10517,{"$f":"F134*(100-#REF!)/100","v":{"$error":"#REF!"}}]
["без лючка, \nдля стола \nпереговоров",null,null,"Столешница прямоугольная 1400х1400","1400х1436х25",11666,{"$f":"F135*(100-#REF!)/100","v":{"$error":"#REF!"}}]
["без лючка, \nдля стола \nпереговоров",null,null,"Столешница прямоугольная 1600х1400","1600х1436х25",13332,{"$f":"F136*(100-#REF!)/100","v":{"$error":"#REF!"}}]
["без лючка, \nдля стола \nпереговоров",null,null,"Столешница прямоугольная 1800х1400","1800х1436х25",14999,{"$f":"F137*(100-#REF!)/100","v":{"$error":"#REF!"}}]
["Столешница 1800х900",null,null,"1800х900х25",null,"нет цены"]
[]
["АРТИКУЛ",null,"ИЗДЕЛИЕ","НАИМЕНОВАНИЕ","РАЗМЕР (ДхШхВ),       мм","ЦЕНА, розница"]
["EVL511 ",null,null,"Экран-фронталь стола 1000, ткань","850х750х22",5890]
[" EVL512",null,null,"Экран стола 1000, ткань","1000х383х22",4105]
["EVL500",null,null,"Экран-фронталь стола 1200, ткань","1050х750х22",7065.47]
["EVL501",null,null,"Экран стола 1200, ткань","1200х383х22",4926.24]
["EVL502",null,null,"Экран-фронталь стола 1400, ткань","1250х750х22",8230.64]
["EVL503",null,null,"Экран стола 1400, ткань","1400х383х22",5678.51]
["EVL504",null,null,"Экран-фронталь стола 1600, ткань","1450х750х22",9062.4599999999991]
["EVL505",null,null,"Экран стола 1600, ткань","1600х383х22",6440.99]
["EVL506",null,null,"Экран-фронталь стола 1800, ткань","1650х750х22",9349.99]
["EVL507",null,null,"Экран стола 1800, ткань","1800х383х22",6882.98]
["EVL508",null,null,"Экран торцевой 600, ткань","600х350х22",2726.22]
["EVL509",null,null,"Экран торцевой 700, ткань ","700х350х22",3057.5]
["EVL510",null,null,"Экран торцевой 800, ткань ","800х350х22",3379.85]
[null,"Экраны, ЛДСП, толщиной 18 мм, цвета: Белый, Rovere, Венге, Салтило, Серый, Орех Гварнери, Антрацит, Честерфильд; Мокко(под заказ 2 нед.)"]
[null,"АРТИКУЛ","ИЗДЕЛИЕ","НАИМЕНОВАНИЕ","РАЗМЕР (ДхШхВ),       мм","ЦЕНА, розница"]
[null,"EVL511 ",null,"Экран-фронталь стола 1000, ЛДСП","850х750х18",1678]
[null," EVL512",null,"Экран стола 1000, ЛДСП","1000х383х18",1148]
[null,"EVL500",null,"Экран-фронталь стола 1200, ЛДСП","1050х750х18",2013.44]
[null,"EVL501",null,"Экран стола 1200, ЛДСП","1200х383х18",1376.8]
[null,"EVL502",null,"Экран-фронталь стола 1400, ЛДСП","1250х750х18",2362.89]
[null,"EVL503",null,"Экран стола 1400, ЛДСП","1400х383х18",1600.08]
[null,"EVL504",null,"Экран-фронталь стола 1600, ЛДСП","1450х750х18",2712.31]
[null,"EVL505",null,"Экран стола 1600, ЛДСП","1600х383х18",1839.99]
[null,"EVL506",null,"Экран-фронталь стола 1800, ЛДСП","1650х750х18",3132.73]
[null,"EVL507",null,"Экран стола 1800, ЛДСП","1800х383х18",2081.5500000000002]
[null,"EVL508",null,"Экран торцевой 600, ЛДСП ","600х350х18",602.1]
[null,"EVL509",null,"Экран торцевой 700, ЛДСП ","700х350х18",455.32]
[null,"EVL510",null,"Экран торцевой 800, ЛДСП","800х350х18",778.98]
[]
["AKS169",null,null,"Кабель канал с креплением к столешнице","800х90х55h\n(для стола 1 м.)","цена по запросу"]
["AKS170",null,null,null,"1000х90х55h\n(для стола 1,2 м.)","цена по запросу"]
["AKS171",null,null,null,"1200х90х55h\n(для стола 1,4 м.)",2370.2399999999998]
["AKS172",null,null,null,"1400х90х55h\n(для стола 1,6 м.)","цена по запросу"]
["AKS173",null,null,null,"1600х90х55h\n(для стола 1,8 м.)","цена по запросу"]
["AKS167",null,null,"Комплект самозажимных кронштейнов для торцевых экранов в ткани 22 мм",null,1129.92]
["AKS168",null,null,"Комплект держателей для фронтали скромности любого размера","165х35х82\n(каждый)",563.04]
["AKS160",null,null,"Комплект самозажимных кронштейнов для торцевых экранов из ЛДСП",null,4309.34]
["AKS161",null,null,"Кабель канал с креплением к экрану для одиночного стола (для экранов ЛДСП и тканевых)","600х100х100",2267.16]
["Фронтали: ЛДСП, толщиной 18 мм, цвета: Белый, Rovere, Венге, Салтило, Серый, Орех Гварнери, Антрацит, Честерфильд, Мокко(под заказ 2 нед.)"]
[null,"EVL139",null,"Фронталь скромности стола 1000 мм","850х365х18",1045]
[null,"EVL140",null,"Фронталь скромности стола 1200 мм","1050х365х18",1197.22]
[null,"EVL141",null,"Фронталь скромности стола 1400 мм","1250х365х18",1349.18]
[null,"EVL142",null,"Фронталь скромности стола 1600 мм","1450х365х18",1538.73]
[null,"EVL143",null,"Фронталь скромности стола 1800 мм","1650х365х18",1728.6]

{"sheet":"Цвет мет. опор","index":14,"n_rows":4,"n_cols":2,"rows_kept":4,"cut":false,"hidden":true,"merged":[]}
["Название цвета","Код цвета"]
["Антрацит","ANT"]
["Белый","WHT"]
["Серый(заказ)","GR"]

{"sheet":"Цвет столешницы","index":15,"n_rows":9,"n_cols":2,"rows_kept":9,"cut":false,"hidden":true,"merged":[]}
["Название цвета","Код цвета"]
["Дуб 131","L"]
["Серый Камень","U727"]
["Белый","H"]
["Антрацит","ANT"]
["Серый","R2"]
["Дуб Честерфилд","U003"]
["Венге ЦАВО","U2108"]
["Бетон","F186"]

{"sheet":"Цвет лючка","index":16,"n_rows":3,"n_cols":2,"rows_kept":3,"cut":false,"hidden":true,"merged":[]}
["Название цвета","Код цвета"]
["Белый","H"]
["Антрацит","ANT"]

{"sheet":"Цвет ткани","index":17,"n_rows":7,"n_cols":2,"rows_kept":7,"cut":false,"hidden":true,"merged":[]}
["Название цвета","Код цвета"]
["Mint","MNT"]
["Grey",2]
["Ash(заказ)","ASH"]
["Yellow(заказ) ","YLW"]
["Denim(заказ) ","DNM"]
["Sand(заказ) ","SND"]

{"sheet":"Цвет корпуса шкафа","index":18,"n_rows":9,"n_cols":2,"rows_kept":9,"cut":false,"hidden":true,"merged":[]}
["Название цвета","Код цвета"]
["Дуб 131","L"]
["Серый Камень","U727"]
["Белый","H"]
["Антрацит","ANT"]
["Серый","R2"]
["Дуб Честерфилд","U003"]
["Венге ЦАВО","U2108"]
["Бетон","F186"]

{"sheet":"Цвет стекла","index":19,"n_rows":3,"n_cols":2,"rows_kept":3,"cut":false,"hidden":true,"merged":[]}
["Название цвета","Код цвета"]
["Прозрачное","G"]
["Тонированное","GRAFIT"]

{"sheet":"Столешницы","index":20,"n_rows":139,"n_cols":9,"rows_kept":139,"cut":false,"hidden":true,"merged":[[0,5,0,8]]}
["EVOLUTION",null,null,null,"цена 2022 года с лючком - цены давал Руслан","Розн цена 2024"]
["Столешницы для столов и бенчей",null,null,null,"Розничная цена","арт","Столешница","Лючок врезной  графит","ИТОГО столешн+лючок"]
[null,null,"Столешница 1000х700","1000х700х25",4188,"PACK1EVL100.SLT",3969.8857142857137,543.42857142857133,{"$f":"SUM(G3:H3)","v":4513.3142857142848}]
[null,"EVL201","Столешница 1200х700","1200х700х25",5151,"PACK1EVL101.U2108",4551.8285714285712,543.42857142857133,{"$f":"SUM(G4:H4)","v":5095.2571428571428}]
[null,"EVL202","Столешница 1400х700","1400х700х25",5741,"PACK1EVL102.U2108",5066.8571428571431,543.42857142857133,5610.2857142857147]
[null,"EVL203","Столешница 1600х700","1600х700х25",6330,"PACK1EVL103.SLT",5504,543.42857142857133,6047.4285714285716]
[null,null,"Столешница 1800х700","1800х700х25",6731,"PACK1EVL104.SLT",6038.9142857142851,543.42857142857133,6582.3428571428567]
[null,null,"Столешница 1000х600","1000х600х25",4166,"PACK1EVL113.U003",3495.9142857142851,543.42857142857133,4039.3428571428567]
[null,null,"Столешница 1200х600","1200х600х25",4467,"PACK1EVL114.SLT",3966.8,543.42857142857133,4510.2285714285717]
[null,null,"Столешница 1400х600","1400х600х25",5020,"PACK1EVL115.SLT",4223.4285714285716,543.42857142857133,4766.8571428571431]
[null,null,"Столешница 1600х600","1600х600х25",5608,"PACK1EVL116.SLT /4",4876.2571428571428,543.42857142857133,5419.6857142857143]
[null,null,"Столешница 1800х600","1800х600х25",6308,null,null,543.42857142857133,543.42857142857133]
[null,null,"Столешница 1000х800","1000х800х25",4685,null,null,543.42857142857133,543.42857142857133]
[null,null,"Столешница 1200х800","1200х800х25",5125,"PACK1EVL118.U003",4801.5714285714284,543.42857142857133,5345]
[null,null,"Столешница 1400х800","1400х800х25",5787,"PACK1EVL119.L",5427.6571428571433,543.42857142857133,5971.0857142857149]
[null,null,"Столешница 1600х800","1600х800х25",6431,"PACK1EVL120.SLT",5968.2857142857138,543.42857142857133,6511.7142857142853]
[null,null,"Столешница 1800х800","1800х800х25",7456,"PACK1EVL163.SLT",6620.1714285714288,543.42857142857133,7163.6]
[null,"EVL205DX","Столешница угловая правая 1200х900","1200х900/700х25",6026,"PACK1EVL105DX.SLT",4575.2285714285708,543.42857142857133,5118.6571428571424]
[null,"EVL205SX","Столешница угловая левая 1200х900","1200х900/700х25",6026,"PACK1EVL105SX.SLT",4575.2285714285708,543.42857142857133,5118.6571428571424]
[null,"EVL206DX","Столешница угловая правая 1400х900","1400х900/700х25",6750,"PACK1EVL106SX.U003",5378.7428571428563,543.42857142857133,5922.1714285714279]
[null,"EVL206SX","Столешница угловая левая 1400х900","1400х900/700х25",6750,"PACK1EVL106SX.U003",5378.7428571428563,543.42857142857133,5922.1714285714279]
[null,"EVL207DX","Столешница угловая правая 1600х900","1600х900/700х25",7496,"PACK1EVL107SX.SLT",5868,543.42857142857133,6411.4285714285716]
[null,"EVL207SX","Столешница угловая левая 1600х900","1600х900/700х25",7496,null,null,543.42857142857133,543.42857142857133]
[null,"EVL209DX","Столешница эргономичная правая 1200х900","1200х900/700х25",5993,"PACK1EVL109DX.SLT",4554.6571428571424,543.42857142857133,5098.0857142857139]
[null,"EVL209SX","Столешница эргономичная левая 1200х900","1200х900/700х25",5993,"PACK1EVL109SX.SLT",4554.6571428571424,543.42857142857133,5098.0857142857139]
[null,"EVL210DX","Столешница эргономичная правая 1400х900","1400х900/700х25",6717,"PACK1EVL110DX.SLT",5191.5714285714284,543.42857142857133,5735]
[null,"EVL210SX","Столешница эргономичная левая 1400х900","1400х900/700х25",6717,"PACK1EVL110SX.SLT",5191.5714285714284,543.42857142857133,5735]
[null,"EVL211DX","Столешница эргономичная правая 1600х900","1600х900/700х25",7457,"PACK1EVL111DX.SLT",5845.1428571428569,543.42857142857133,6388.5714285714284]
[null,"EVL211SX","Столешница эргономичная левая 1600х900","1600х900/700х25",7457,"PACK1EVL111SX.SLT",5845.1428571428569,543.42857142857133,6388.5714285714284]
[null,null,"Столешница угловая правая 1200х900","1200х900/600х25",5673,"PACK1EVL123SX.SLT",5103.9142857142851,543.42857142857133,5647.3428571428567]
[null,null,"Столешница угловая левая 1200х900","1200х900/600х25",5673,"PACK1EVL123SX.SLT",5103.9142857142851,543.42857142857133,5647.3428571428567]
[null,null,"Столешница угловая правая 1400х900","1400х900/600х25",6398,124,null,543.42857142857133,543.42857142857133]
[null,null,"Столешница угловая левая 1400х900","1400х900/600х25",6398,null,null,543.42857142857133,543.42857142857133]
[null,null,"Столешница угловая правая 1600х900","1600х900/600х25",7143,null,null,543.42857142857133,543.42857142857133]
[null,null,"Столешница угловая левая 1600х900","1600х900/600х25",7143,null,null,543.42857142857133,543.42857142857133]
[null,null,"Столешница угловая правая 1200х900","1200х900/800х25",5673,125,null,543.42857142857133,543.42857142857133]
[null,null,"Столешница угловая левая 1200х900","1200х900/800х25",5673,125,null,543.42857142857133,543.42857142857133]
[null,null,"Столешница угловая правая 1400х900","1400х900/800х25",6398,125,null,543.42857142857133,543.42857142857133]
[null,null,"Столешница угловая левая 1400х900","1400х900/800х25",6398,null,null,543.42857142857133,543.42857142857133]
[null,null,"Столешница угловая правая 1600х900","1600х900/800х25",7143,"PACK1EVL126DX.U003",6382.8571428571422,543.42857142857133,6926.2857142857138]
[null,null,"Столешница угловая левая 1600х900","1600х900/800х25",7143,null,null,543.42857142857133,543.42857142857133]
[null,null,"Столешница эргономичная угловая\n  левая/правая 1600х1300","1600х1300/700x700",8682,null,null,543.42857142857133,543.42857142857133]
[null,null,"Столешница эргономичная угловая\n 1400х1200","1400х1200/700",7596,"PACK1EVL129SX.U003",7442.8571428571422,543.42857142857133,7986.2857142857138]
[null,null,"Столешница эргономичная угловая\n 1400х1200","1400х1200/600x600",7596,null,null,543.42857142857133,543.42857142857133]
[null,null,"Столешница эргономичная угловая\n 1600х1200","1600х1200/600x600",8682,null,null,543.42857142857133,543.42857142857133]
[null,null,"Столешница эргономичная угловая\n 1400х1200","1400х1200/700x600",7596,null,null,543.42857142857133,543.42857142857133]
[null,null,"Столешница эргономичная угловая\n 1600х1200","1600х1200/700x600",8682,"PACK1EVL130DX.U003",7917.8285714285694,543.42857142857133,8461.2571428571409]
[null,null,"Столешница эргономичная угловая\n 1400х1200","1400х1200/800x600",7596,null,null,543.42857142857133,543.42857142857133]
[null,null,"Столешница эргономичная угловая\n 1600х1200","1600х1200/800x600",8682,"PACK1EVL132DX.U003",7949.5714285714284,543.42857142857133,8493]
[null,null,"Столешница эргономичная угловая\n 1200х1200","1200х1200/600x600",6870,null,null,543.42857142857133,543.42857142857133]
[null,null,"Столешница эргономичная угловая\n 1200х1200","1200х1200/700x600",6870,null,null,543.42857142857133,543.42857142857133]
[null,null,"Столешница эргономичная угловая\n 1200х1200","1200х1200/800x600",6870,null,null,543.42857142857133,543.42857142857133]
[]
[null,"Артикул","Номенклатура/статья затрат","Ст","Ц","Характеристика номенклатуры","Цена Новая","Цена Новая со ск."]
[{"$f":"LEFT(B55,6)","v":"EVL001"},"EVL001.ANT","Набор опор цельносварных крайних 40x40 П700","Нет ","Нет ","АНТРАЦИТ",7324.7999999999993,4101.8879999999999]
[{"$f":"LEFT(B56,6)","v":"EVL002"},"EVL002.ANT","Комплект траверс (40х20) для прямого стола 1200","Нет ","Нет ","АНТРАЦИТ",5045.8285714285712,2825.6640000000002]
["EVL003","EVL003.WHT","Комплект траверс (40х20) для прямого стола 1400","Нет ","Нет ","WHITE",5220.6857142857143,2923.5840000000003]
["EVL004","EVL004.ANT","Комплект траверс (40х20) для прямого стола 1600","Нет ","Нет ","АНТРАЦИТ",5366.4,3005.1840000000002]
["EVL005","EVL005.WHT","Набор опор цельносварных крайних 60x30 П700","Нет ","Нет ","WHITE",7517.1428571428569,4209.6000000000004]
["EVL006","EVL006.ANT","Комплект траверс (60х30) для прямого стола 1200","Нет ","Нет ","АНТРАЦИТ",4958.3999999999996,2776.7040000000002]
["EVL007","EVL007.WHT","Комплект траверс (60х30) для прямого стола 1400","Нет ","Нет ","WHITE",5214.8571428571422,2920.32]
["EVL008","EVL008.ANT","Комплект траверс (60х30) для прямого стола 1600","Нет ","Нет ","АНТРАЦИТ",5278.9714285714281,2956.2240000000002]
["EVL009","EVL009.WHT","Опора цельносварная крайняя 60x30 О700","Нет ","Нет ","WHITE",4393.028571428571,2460.096]
["EVL010","EVL010.ANT","Опора приставки цельносварная 40x40 П500","Нет ","Нет ","АНТРАЦИТ",4075.3714285714282,2282.2080000000001]
["EVL011","EVL011.WHT","Опора приставки цельносварная 60x30 П500","Нет ","Нет ","WHITE",4156.9714285714281,2327.904]
["EVL012","EVL012.WHT","Опора приставки цельносварная 60x30 O500","Нет ","Нет ","WHITE",4156.9714285714281,2327.904]
["EVL013","EVL013.WHT","Комплект траверс (40х20) для приставки 1000","Нет ","Нет ","WHITE",4754.3999999999996,2662.4639999999999]
["EVL014","EVL014.ANT","Комплект траверс (60х30) для приставки 1000","Нет ","Нет ","АНТРАЦИТ",4841.8285714285721,2711.4240000000004]
["EVL015","EVL015.WHT","Опора цельносварная промежуточная 40x40 П700","Нет ","Нет ","WHITE",5267.3142857142848,2949.6959999999999]
["EVL016","EVL016.WHT","Опора цельносварная промежуточная 40x40 O700","Нет ","Нет ","WHITE",4474.6285714285705,2505.7919999999999]
["EVL017","EVL017.ANT","Опора цельносварная промежуточная 60x30 П700","Нет ","Нет ","АНТРАЦИТ",5471.3142857142857,3063.9360000000001]
["EVL018","EVL018.WHT","Опора цельносварная промежуточная 60x30 O700","Нет ","Нет ","WHITE",4626.1714285714288,2590.6560000000004]
["EVL019","EVL019.ANT","Опора цельносварная крайняя 40x40 П1436","Нет ","Нет ","АНТРАЦИТ",4865.1428571428569,2724.48]
["EVL020","EVL020.ANT","Опора цельносварная крайняя 60x30 П1436","Нет ","Нет ","АНТРАЦИТ",4999.2,2799.5520000000001]
["EVL021","EVL021.WHT","Опора цельносварная крайняя 40x40 O1436","Нет ","Нет ","WHITE",6007.5428571428565,3364.2240000000002]
["EVL022","EVL022.ANT","Опора цельносварная крайняя 60x30 O1436","Нет ","Нет ","АНТРАЦИТ",5955.0857142857149,3334.8480000000004]
["EVL023","EVL023.ANT","Опора цельносварная промежуточная 40x40 П1436","Нет ","Нет ","АНТРАЦИТ",7030.4571428571426,3937.056]
["EVL024","EVL024.ANT","Опора цельносварная промежуточная 60x30 П1436","Нет ","Нет ","АНТРАЦИТ",7269.4285714285716,4070.8800000000006]
["EVL025","EVL025.WHT","Опора цельносварная промежуточная 40x40 O1436","Нет ","Нет ","WHITE",6010.4571428571417,3365.8559999999998]
["EVL026","EVL026.ANT","Опора цельносварная промежуточная 60x30 O1436","Нет ","Нет ","АНТРАЦИТ",6249.4285714285716,3499.6800000000003]
["EVL027","EVL027.WHT","Набор опор цельносварных крайних 60x30 П600","Нет ","Нет ","WHITE",7192.1428571428569,4027.6000000000004]
["EVL028","EVL028.ANT","Опора цельносварная крайняя 60x30 О600","Нет ","Нет ","АНТРАЦИТ",4264.7999999999993,2388.288]
["EVL029","EVL029.WHT","Набор опор цельносварных крайних 40x40 П600","Нет ","Нет ","WHITE",7114.9714285714281,3984.384]
["EVL030","EVL030.ANT","Опора цельносварная крайняя 40x40 О600","Нет ","Нет ","АНТРАЦИТ",3926.7428571428568,2198.9760000000001]
["EVL031","EVL031.WHT","Опора цельносварная промежуточная 40x40 П600","Нет ","Нет ","WHITE",5066.2285714285717,2837.0880000000002]
["EVL032","EVL032.WHT","Опора цельносварная промежуточная 40x40 О600","Нет ","Нет ","WHITE",4346.3999999999996,2433.9839999999999]
["EVL034","EVL034.WHT","Опора цельносварная промежуточная 60x30 О600","Нет ","Нет ","WHITE",4521.2571428571437,2531.9040000000005]
["EVL035","EVL035.ANT","Комплект траверс (40х20) для прямого стола 1800","Нет ","Нет ","АНТРАЦИТ",5529.5999999999995,3096.576]
["EVL036","EVL036.ANT","Комплект траверс (60х30) для прямого стола 1800","Нет ","Нет ","АНТРАЦИТ",5422.6,3036.6560000000004]
["EVL037","EVL037.ANT","Опора цельносварная крайняя 40x40 П1236","Нет ","Нет ","АНТРАЦИТ",4786.4571428571426,2680.4160000000002]
["EVL038","EVL038.ANT","Опора цельносварная крайняя 60x30 П1236","Нет ","Нет ","АНТРАЦИТ",4920.5142857142855,2755.4880000000003]
["EVL040","EVL040.ANT","Опора цельносварная крайняя 60x30 O1236","Нет ","Нет ","АНТРАЦИТ",5995.8857142857132,3357.6959999999999]
["EVL041","EVL041.ANT","Опора цельносварная промежуточная 40x40 П1236","Нет ","Нет ","АНТРАЦИТ",6951.7714285714283,3892.9920000000002]
["EVL042","EVL042.WHT","Опора цельносварная промежуточная 60x30 П1236","Нет ","Нет ","WHITE",7190.7428571428582,4026.8160000000007]
["EVL044","EVL044.ANT","Опора цельносварная промежуточная 60x30 O1236","Нет ","Нет ","АНТРАЦИТ",5995.8857142857132,3357.6959999999999]
["EVL045","EVL045.ANT","Набор опор цельносварных крайних 60x30 П800","Нет ","Нет ","АНТРАЦИТ",7773.5999999999995,4353.2160000000003]
["EVL046","EVL046.ANT","Опора цельносварная крайняя 60x30 О800","Нет ","Нет ","АНТРАЦИТ",4381.3714285714286,2453.5680000000002]
["EVL047","EVL047.ANT","Набор опор цельносварных крайних 40x40 П800","Нет ","Нет ","АНТРАЦИТ",7470.5142857142855,4183.4880000000003]
["EVL048","EVL048.ANT","Опора цельносварная крайняя 40x40 О800","Нет ","Нет ","АНТРАЦИТ",4183.2,2342.5920000000001]
["EVL049","EVL049.ANT","Опора цельносварная промежуточная 40x40 П800","Нет ","Нет ","АНТРАЦИТ",5092.4571428571417,2851.7759999999998]
["EVL051","EVL051.WHT","Опора цельносварная промежуточная 60x30 П800","Нет ","Нет ","WHITE",5343.0857142857139,2992.1280000000002]
["EVL053","EVL053.ANT","Комплект траверс (40х20) для прямого стола 1000","Нет ","Нет ","АНТРАЦИТ",4841.8285714285721,2711.4240000000004]
["EVL054","EVL054.ANT","Комплект траверс (60х30) для прямого стола 1000","Нет ","Нет ","АНТРАЦИТ",4756.028571428571,2663.3760000000002]
["EVL055","EVL055.ANT","Набор опор цельносварных крайних 60x30 A600","Нет ","Нет ","АНТРАЦИТ",7336.4571428571426,4108.4160000000002]
["EVL056","EVL056.ANT","Набор опор цельносварных крайних 40x40 А600","Нет ","Нет ","АНТРАЦИТ",7114.9714285714281,3984.384]
["EVL059","EVL059.ANT","Набор опор цельносварных крайних 60x30 А700","Нет ","Нет ","АНТРАЦИТ",7517.1428571428569,4209.6000000000004]
["EVL063","EVL063.ANT","Набор опор цельносварных крайних 60x30 А800","Нет ","Нет ","АНТРАЦИТ",7779.4285714285716,4356.4800000000005]
["EVL067","EVL067DX.ANT","Комплект опор для опорного стола правого 40x40 П700","Нет ","Нет ","АНТРАЦИТ",7138.4571428571426,3997.5360000000001]
["EVL068","EVL068.ANT","Опора цельносварная крайняя 40x40 О700","Нет ","Нет ","АНТРАЦИТ",4066.6285714285709,2277.3119999999999]
["EVL070","EVL070DX.ANT","Комплект опор для опорного стола правого 60x30 П700","Нет ","Нет ","АНТРАЦИТ",7755.5428571428565,4343.1040000000003]
["EVL071","EVL071DX.ANT","Комплект опор для опорного стола правого 60x30 О700","Нет ","Нет ","АНТРАЦИТ",8072.7999999999993,4520.768]
["EVL073","EVL073.ANT","Опора цельносварная крайняя 60x30 А1436","Нет ","Нет ","АНТРАЦИТ",4999.2,2799.5520000000001]
["EVL075","EVL075.ANT","Опора цельносварная промежуточная 60x30 А1436","Нет ","Нет ","АНТРАЦИТ",7269.4285714285716,4070.8800000000006]
["EVL077","EVL077.ANT","Опора цельносварная крайняя 60x30 А1236","Нет ","Нет ","АНТРАЦИТ",4917.6000000000004,2753.8560000000002]
["EVL081","EVL081.ANT","Опора цельносварная крайняя 60x30 А1636","Нет ","Нет ","АНТРАЦИТ",5378.057142857142,3011.712]
["EVL082","EVL082.ANT","Опора цельносварная крайняя 60x30 О1636","Нет ","Нет ","АНТРАЦИТ",6890.5714285714275,3858.72]
["EVL083","EVL083.WHT","Опора приставки цельносварная 40x40 О500","Нет ","Нет ","WHITE",4075.3714285714282,2282.2080000000001]
["EVL084","EVL084.ANT","Опора приставки цельносварная 40x40 П700","Нет ","Нет ","АНТРАЦИТ",4171.5428571428565,2336.0639999999999]
["EVL085","EVL085.ANT","Опора приставки цельносварная 60x30 П700","Нет ","Нет ","АНТРАЦИТ",4317.2571428571428,2417.6640000000002]
[{"$f":"LEFT(B120,6)","v":"EVL089"},"EVL089.WHT","Опора цельносварная крайняя 40x40 П600","Нет ","Нет ","WHITE",3603.2571428571432,2017.8240000000003]
["EVL090","EVL090.WHT","Опора цельносварная крайняя 60x30 А600","Нет ","Нет ","WHITE",3714,2079.84]
["EVL092","EVL092.ANT","Опора цельносварная крайняя 60x30 П600","Нет ","Нет ","АНТРАЦИТ",3641.8285714285716,2039.4240000000002]
["EVL093","EVL093.WHT","Комплект траверс (40х20) для эргономичного стола","Нет ","Нет ","WHITE",4544.6857142857143,2545.0240000000003]
["EVL094","EVL094.WHT","Комплект траверс (60х30) для эргономичного стола","Нет ","Нет ","WHITE",4544.6857142857143,2545.0240000000003]
["EVL095","EVL095.WHT","Опора приставки цельносварная 40x40 П600","Нет ","Нет ","WHITE",4142.3999999999996,2319.7440000000001]
["EVL096","EVL096.ANT","Опора приставки цельносварная 60x30 П600","Нет ","Нет ","АНТРАЦИТ",4229.8285714285712,2368.7040000000002]
["EVL097","EVL097.ANT","Комплект траверс (40х20) для приставки 1200","Нет ","Нет ","АНТРАЦИТ",4958.3999999999996,2776.7040000000002]
["EVL098","EVL098.ANT","Комплект траверс (60х30) для приставки 1200","Нет ","Нет ","АНТРАЦИТ",4958.3999999999996,2776.7040000000002]
["EVL099","EVL099.ANT","Комплект траверс (40х20) для приставки 800","Нет ","Нет ","АНТРАЦИТ",4761.6857142857134,2666.5439999999999]
[{"$f":"LEFT(B130,6)","v":"EVL201"},"EVL201.ANT","Комплект траверс (60х30) для приставки 800","Нет ","Нет ","АНТРАЦИТ",4761.6857142857134,2666.5439999999999]
[{"$f":"LEFT(B131,6)","v":"EVL202"},"EVL202.WHT","Комплект траверс (40х20) для приставки 600","Нет ","Нет ","WHITE",4617.3714285714286,2585.7280000000001]
["EVL203","EVL203.WHT","Комплект траверс (60х30) для приставки 600","Нет ","Нет ","WHITE",4617.3714285714286,2585.7280000000001]
["EVL205","EVL205.ANT","Опора цельносварная крайняя 60x30 П1636","Нет ","Нет ","АНТРАЦИТ",5380.9714285714281,3013.3440000000001]
["EVL206","EVL206.ANT","Опора приставки цельносварная 60x30 О700","Нет ","Нет ","АНТРАЦИТ",4754.3999999999996,2662.4639999999999]
["EVL207","EVL207.ANT","Опора приставки цельносварная 60x30 О600","Нет ","Нет ","АНТРАЦИТ",4870.9714285714281,2727.7440000000001]
["EVL208","EVL208.ANT","Опора цельносварная промежуточная 60x30 П1636","Нет ","Нет ","АНТРАЦИТ",7648.2857142857138,4283.04]
["EVL209","EVL209.ANT","Опора цельносварная крайняя 40x40 П1636","Нет ","Нет ","АНТРАЦИТ",5165.3142857142857,2892.576]
["EVL210","EVL210.ANT","Опора цельносварная промежуточная 40x40 П1636","Нет ","Нет ","АНТРАЦИТ",6986.7428571428572,3912.5760000000005]
["EVL211","EVL211.ANT","Опора цельносварная промежуточная 60x30 А1636","Нет ","Нет ","АНТРАЦИТ",7648.2857142857138,4283.04]

{"sheet":"Лист3","index":21,"n_rows":0,"n_cols":0,"rows_kept":0,"cut":false,"hidden":true,"merged":[]}